{"text_format":"1","workbook":"xlsx","n_sheets":12,"sheets":["PÇAĞE","Lapse 10_20 Tabloxer ORJ (2)","tablo","10","20","20 ĺapsew (ORJ)","l'ıte_2","pş'ı oaćew","A_NEW","l'ıte_3","AK","makro_ayarları"],"not_rendered":{"charts":0,"images":0,"macros":1,"external_links":1,"defined_names":297,"comments":0,"pivot_tables":0},"unopened":[],"bounds":{"document_bytes":16777216,"sheet_cells":100000,"rows_first":2000,"rows_last":500,"rows_between":2000,"halvings":0,"cell_chars":16384,"cell_head_chars":4096},"cells_cut":0,"cells_raw":0,"read":"whole","date_system":"1900"}

{"sheet":"PÇAĞE","index":0,"n_rows":4404,"n_cols":9,"rows_kept":4404,"cut":false,"hidden":false,"merged":[[3,1,3,3],[2,1,2,3],[4,1,4,3],[5,1,5,3]]}
[]
[]
[null,199273055133677]
[null,{"$f":"TRIM('10'!B4)","v":"Şe Bğuć Bğu Trilyon Ṫu Şe Blıć Şı Milyar Tfıć Tfı Milyon Şe Şıć Şı Min Xı Şe Blıć Blı"}]
[null,{"$f":"TRIM('l''ıte_2'!B4)","v":"Şe Bğupş`ı Bğu Trimelvan T'`u Şe Blıḉ Şı Milyar Tfıpş`ı Tfı Melwan Şe Şıpş`ı Şı Min Xı Şe Blıḉ Blı"}]
[null,{"$f":"TRIM('20'!B4)","v":"Şe Ṫoćipĺ`ıre Pş'ıqubğure Trilyon Ṫu Şe Ṫoćişre Pş'ıquşre şı Milyar Ṫoćiṫure Pş'ıqutfıre tfı Milyon Şe Ṫoćıre Pş'ıquşre şı Min xı Şe Ṫoćişre Pş'ıqubĺıre blı"}]
[]
[]
[]
[]
[]
[]
[]
[]
[]
[]
[]
[]
[]
[]
[]
[]
[]
[]
[]
[]
[]
[]
[]
[]
[]
[]
[]
[]
[]
[]
[]
[]
[]
[]
[]
[]
[]
[]
[]
[]
[]
[]
[]
[]
[]
[]
[]
[]
[]
[]
[]
[]
[]
[]
[]
[]
[]
[]
[]
[]
[]
[]
[]
[]
[]
[]
[]
[]
[]
[]
[]
[]
[]
[]
[]
[]
[]
[]
[]
[]
[]
[]
[]
[]
[]
[]
[]
[]
[]
[]
[]
[]
[]
[]
[]
[]
[]
[]
[]
[]
[]
[]
[]
[]
[]
[]
[]
[]
[]
[]
[]
[]
[]
[]
[]
[]
[]
[]
[]
[]
[]
[]
[]
[]
[]
[]
[]
[]
[]
[]
[]
[]
[]
[]
[]
[]
[]
[]
[]
[]
[]
[]
[]
[]
[]
[]
[]
[]
[]
[]
[]
[]
[]
[]
[]
[]
[]
[]
[]
[]
[]
[]
[]
[]
[]
[]
[]
[]
[]
[]
[]
[]
[]
[]
[]
[]
[]
[]
[]
[]
[]
[]
[]
[]
[]
[]
[]
[]
[]
[]
[]
[]
[]
[]
[]
[]
[]
[]
[]
[]
[]
[]
[]
[]
[]
[]
[]
[]
[]
[]
[]
[]
[]
[]
[]
[]
[]
[]
[]
[]
[]
[]
[]
[]
[]
[]
[]
[]
[]
[]
[]
[]
[]
[]
[]
[]
[]
[]
[]
[]
[]
[]
[]
[]
[]
[]
[]
[]
[]
[]
[]
[]
[]
[]
[]
[]
[]
[]
[]
[]
[]
[]
[]
[]
[]
[]
[]
[]
[]
[]
[]
[]
[]
[]
[]
[]
[]
[]
[]
[]
[]
[]
[]
[]
[]
[]
[]
[]
[]
[]
[]
[]
[]
[]
[]
[]
[]
[]
[]
[]
[]
[]
[]
[]
[]
[]
[]
[]
[]
[]
[]
[]
[]
[]
[]
[]
[]
[]
[]
[]
[]
[]
[]
[]
[]
[]
[]
[]
[]
[]
[]
[]
[]
[]
[]
[]
[]
[]
[]
[]
[]
[]
[]
[]
[]
[]
[]
[]
[]
[]
[]
[]
[]
[]
[]
[]
[]
[]
[]
[]
[]
[]
[]
[]
[]
[]
[]
[]
[]
[]
[]
[]
[]
[]
[]
[]
[]
[]
[]
[]
[]
[]
[]
[]
[]
[]
[]
[]
[]
[]
[]
[]
[]
[]
[]
[]
[]
[]
[]
[]
[]
[]
[]
[]
[]
[]
[]
[]
[]
[]
[]
[]
[]
[]
[]
[]
[]
[]
[]
[]
[]
[]
[]
[]
[]
[]
[]
[]
[]
[]
[]
[]
[]
[]
[]
[]
[]
[]
[]
[]
[]
[]
[]
[]
[]
[]
[]
[]
[]
[]
[]
[]
[]
[]
[]
[]
[]
[]
[]
[]
[]
[]
[]
[]
[]
[]
[]
[]
[]
[]
[]
[]
[]
[]
[]
[]
[]
[]
[]
[]
[]
[]
[]
[]
[]
[]
[]
[]
[]
[]
[]
[]
[]
[]
[]
[]
[]
[]
[]
[]
[]
[]
[]
[]
[]
[]
[]
[]
[]
[]
[]
[]
[]
[]
[]
[]
[]
[]
[]
[]
[]
[]
[]
[]
[]
[]
[]
[]
[]
[]
[]
[]
[]
[]
[]
[]
[]
[]
[]
[]
[]
[]
[]
[]
[]
[]
[]
[]
[]
[]
[]
[]
[]
[]
[]
[]
[]
[]
[]
[]
[]
[]
[]
[]
[]
[]
[]
[]
[]
[]
[]
[]
[]
[]
[]
[]
[]
[]
[]
[]
[]
[]
[]
[]
[]
[]
[]
[]
[]
[]
[]
[]
[]
[]
[]
[]
[]
[]
[]
[]
[]
[]
[]
[]
[]
[]
[]
[]
[]
[]
[]
[]
[]
[]
[]
[]
[]
[]
[]
[]
[]
[]
[]
[]
[]
[]
[]
[]
[]
[]
[]
[]
[]
[]
[]
[]
[]
[]
[]
[]
[]
[]
[]
[]
[]
[]
[]
[]
[]
[]
[]
[]
[]
[]
[]
[]
[]
[]
[]
[]
[]
[]
[]
[]
[]
[]
[]
[]
[]
[]
[]
[]
[]
[]
[]
[]
[]
[]
[]
[]
[]
[]
[]
[]
[]
[]
[]
[]
[]
[]
[]
[]
[]
[]
[]
[]
[]
[]
[]
[]
[]
[]
[]
[]
[]
[]
[]
[]
[]
[]
[]
[]
[]
[]
[]
[]
[]
[]
[]
[]
[]
[]
[]
[]
[]
[]
[]
[]
[]
[]
[]
[]
[]
[]
[]
[]
[]
[]
[]
[]
[]
[]
[]
[]
[]
[]
[]
[]
[]
[]
[]
[]
[]
[]
[]
[]
[]
[]
[]
[]
[]
[]
[]
[]
[]
[]
[]
[]
[]
[]
[]
[]
[]
[]
[]
[]
[]
[]
[]
[]
[]
[]
[]
[]
[]
[]
[]
[]
[]
[]
[]
[]
[]
[]
[]
[]
[]
[]
[]
[]
[]
[]
[]
[]
[]
[]
[]
[]
[]
[]
[]
[]
[]
[]
[]
[]
[]
[]
[]
[]
[]
[]
[]
[]
[]
[]
[]
[]
[]
[]
[]
[]
[]
[]
[]
[]
[]
[]
[]
[]
[]
[]
[]
[]
[]
[]
[]
[]
[]
[]
[]
[]
[]
[]
[]
[]
[]
[]
[]
[]
[]
[]
[]
[]
[]
[]
[]
[]
[]
[]
[]
[]
[]
[]
[]
[]
[]
[]
[]
[]
[]
[]
[]
[]
[]
[]
[]
[]
[]
[]
[]
[]
[]
[]
[]
[]
[]
[]
[]
[]
[]
[]
[]
[]
[]
[]
[]
[]
[]
[]
[]
[]
[]
[]
[]
[]
[]
[]
[]
[]
[]
[]
[]
[]
[]
[]
[]
[]
[]
[]
[]
[]
[]
[]
[]
[]
[]
[]
[]
[]
[]
[]
[]
[]
[]
[]
[]
[]
[]
[]
[]
[]
[]
[]
[]
[]
[]
[]
[]
[]
[]
[]
[]
[]
[]
[]
[]
[]
[]
[]
[]
[]
[]
[]
[]
[]
[]
[]
[]
[]
[]
[]
[]
[]
[]
[]
[]
[]
[]
[]
[]
[]
[]
[]
[]
[]
[]
[]
[]
[]
[]
[]
[]
[]
[]
[]
[]
[]
[]
[]
[]
[]
[]
[]
[]
[]
[]
[]
[]
[]
[]
[]
[]
[]
[]
[]
[]
[]
[]
[]
[]
[]
[]
[]
[]
[]
[]
[]
[]
[]
[]
[]
[]
[]
[]
[]
[]
[]
[]
[]
[]
[]
[]
[]
[]
[]
[]
[]
[]
[]
[]
[]
[]
[]
[]
[]
[]
[]
[]
[]
[]
[]
[]
[]
[]
[]
[]
[]
[]
[]
[]
[]
[]
[]
[]
[]
[]
[]
[]
[]
[]
[]
[]
[]
[]
[]
[]
[]
[]
[]
[]
[]
[]
[]
[]
[]
[]
[]
[]
[]
[]
[]
[]
[]
[]
[]
[]
[]
[]
[]
[]
[]
[]
[]
[]
[]
[]
[]
[]
[]
[]
[]
[]
[]
[]
[]
[]
[]
[]
[]
[]
[]
[]
[]
[]
[]
[]
[]
[]
[]
[]
[]
[]
[]
[]
[]
[]
[]
[]
[]
[]
[]
[]
[]
[]
[]
[]
[]
[]
[]
[]
[]
[]
[]
[]
[]
[]
[]
[]
[]
[]
[]
[]
[]
[]
[]
[]
[]
[]
[]
[]
[]
[]
[]
[]
[]
[]
[]
[]
[]
[]
[]
[]
[]
[]
[]
[]
[]
[]
[]
[]
[]
[]
[]
[]
[]
[]
[]
[]
[]
[]
[]
[]
[]
[]
[]
[]
[]
[]
[]
[]
[]
[]
[]
[]
[]
[]
[]
[]
[]
[]
[]
[]
[]
[]
[]
[]
[]
[]
[]
[]
[]
[]
[]
[]
[]
[]
[]
[]
[]
[]
[]
[]
[]
[]
[]
[]
[]
[]
[]
[]
[]
[]
[]
[]
[]
[]
[]
[]
[]
[]
[]
[]
[]
[]
[]
[]
[]
[]
[]
[]
[]
[]
[]
[]
[]
[]
[]
[]
[]
[]
[]
[]
[]
[]
[]
[]
[]
[]
[]
[]
[]
[]
[]
[]
[]
[]
[]
[]
[]
[]
[]
[]
[]
[]
[]
[]
[]
[]
[]
[]
[]
[]
[]
[]
[]
[]
[]
[]
[]
[]
[]
[]
[]
[]
[]
[]
[]
[]
[]
[]
[]
[]
[]
[]
[]
[]
[]
[]
[]
[]
[]
[]
[]
[]
[]
[]
[]
[]
[]
[]
[]
[]
[]
[]
[]
[]
[]
[]
[]
[]
[]
[]
[]
[]
[]
[]
[]
[]
[]
[]
[]
[]
[]
[]
[]
[]
[]
[]
[]
[]
[]
[]
[]
[]
[]
[]
[]
[]
[]
[]
[]
[]
[]
[]
[]
[]
[]
[]
[]
[]
[]
[]
[]
[]
[]
[]
[]
[]
[]
[]
[]
[]
[]
[]
[]
[]
[]
[]
[]
[]
[]
[]
[]
[]
[]
[]
[]
[]
[]
[]
[]
[]
[]
[]
[]
[]
[]
[]
[]
[]
[]
[]
[]
[]
[]
[]
[]
[]
[]
[]
[]
[]
[]
[]
[]
[]
[]
[]
[]
[]
[]
[]
[]
[]
[]
[]
[]
[]
[]
[]
[]
[]
[]
[]
[]
[]
[]
[]
[]
[]
[]
[]
[]
[]
[]
[]
[]
[]
[]
[]
[]
[]
[]
[]
[]
[]
[]
[]
[]
[]
[]
[]
[]
[]
[]
[]
[]
[]
[]
[]
[]
[]
[]
[]
[]
[]
[]
[]
[]
[]
[]
[]
[]
[]
[]
[]
[]
[]
[]
[]
[]
[]
[]
[]
[]
[]
[]
[]
[]
[]
[]
[]
[]
[]
[]
[]
[]
[]
[]
[]
[]
[]
[]
[]
[]
[]
[]
[]
[]
[]
[]
[]
[]
[]
[]
[]
[]
[]
[]
[]
[]
[]
[]
[]
[]
[]
[]
[]
[]
[]
[]
[]
[]
[]
[]
[]
[]
[]
[]
[]
[]
[]
[]
[]
[]
[]
[]
[]
[]
[]
[]
[]
[]
[]
[]
[]
[]
[]
[]
[]
[]
[]
[]
[]
[]
[]
[]
[]
[]
[]
[]
[]
[]
[]
[]
[]
[]
[]
[]
[]
[]
[]
[]
[]
[]
[]
[]
[]
[]
[]
[]
[]
[]
[]
[]
[]
[]
[]
[]
[]
[]
[]
[]
[]
[]
[]
[]
[]
[]
[]
[]
[]
[]
[]
[]
[]
[]
[]
[]
[]
[]
[]
[]
[]
[]
[]
[]
[]
[]
[]
[]
[]
[]
[]
[]
[]
[]
[]
[]
[]
[]
[]
[]
[]
[]
[]
[]
[]
[]
[]
[]
[]
[]
[]
[]
[]
[]
[]
[]
[]
[]
[]
[]
[]
[]
[]
[]
[]
[]
[]
[]
[]
[]
[]
[]
[]
[]
[]
[]
[]
[]
[]
[]
[]
[]
[]
[]
[]
[]
[]
[]
[]
[]
[]
[]
[]
[]
[]
[]
[]
[]
[]
[]
[]
[]
[]
[]
[]
[]
[]
[]
[]
[]
[]
[]
[]
[]
[]
[]
[]
[]
[]
[]
[]
[]
[]
[]
[]
[]
[]
[]
[]
[]
[]
[]
[]
[]
[]
[]
[]
[]
[]
[]
[]
[]
[]
[]
[]
[]
[]
[]
[]
[]
[]
[]
[]
[]
[]
[]
[]
[]
[]
[]
[]
[]
[]
[]
[]
[]
[]
[]
[]
[]
[]
[]
[]
[]
[]
[]
[]
[]
[]
[]
[]
[]
[]
[]
[]
[]
[]
[]
[]
[]
[]
[]
[]
[]
[]
[]
[]
[]
[]
[]
[]
[]
[]
[]
[]
[]
[]
[]
[]
[]
[]
[]
[]
[]
[]
[]
[]
[]
[]
[]
[]
[]
[]
[]
[]
[]
[]
[]
[]
[]
[]
[]
[]
[]
[]
[]
[]
[]
[]
[]
[]
[]
[]
[]
[]
[]
[]
[]
[]
[]
[]
[]
[]
[]
[]
[]
[]
[]
[]
[]
[]
[]
[]
[]
[]
[]
[]
[]
[]
[]
[]
[]
[]
[]
[]
[]
[]
[]
[]
[]
[]
[]
[]
[]
[]
[]
[]
[]
[]
[]
[]
[]
[]
[]
[]
[]
[]
[]
[]
[]
[]
[]
[]
[]
[]
[]
[]
[]
[]
[]
[]
[]
[]
[]
[]
[]
[]
[]
[]
[]
[]
[]
[]
[]
[]
[]
[]
[]
[]
[]
[]
[]
[]
[]
[]
[]
[]
[]
[]
[]
[]
[]
[]
[]
[]
[]
[]
[]
[]
[]
[]
[]
[]
[]
[]
[]
[]
[]
[]
[]
[]
[]
[]
[]
[]
[]
[]
[]
[]
[]
[]
[]
[]
[]
[]
[]
[]
[]
[]
[]
[]
[]
[]
[]
[]
[]
[]
[]
[]
[]
[]
[]
[]
[]
[]
[]
[]
[]
[]
[]
[]
[]
[]
[]
[]
[]
[]
[]
[]
[]
[]
[]
[]
[]
[]
[]
[]
[]
[]
[]
[]
[]
[]
[]
[]
[]
[]
[]
[]
[]
[]
[]
[]
[]
[]
[]
[]
[]
[]
[]
[]
[]
[]
[]
[]
[]
[]
[]
[]
[]
[]
[]
[]
[]
[]
[]
[]
[]
[]
[]
[]
[]
[]
[]
[]
[]
[]
[]
[]
[]
[]
[]
[]
[]
[]
[]
[]
[]
[]
[]
[]
[]
[]
[]
[]
[]
[]
[]
[]
[]
[]
[]
[]
[]
[]
[]
[]
[]
[]
[]
[]
[]
[]
[]
[]
[]
[]
[]
[]
[]
[]
[]
[]
[]
[]
[]
[]
[]
[]
[]
[]
[]
[]
[]
[]
[]
[]
[]
[]
[]
[]
[]
[]
[]
[]
[]
[]
[]
[]
[]
[]
[]
[]
[]
[]
[]
[]
[]
[]
[]
[]
[]
[]
[]
[]
[]
[]
[]
[]
[]
[]
[]
[]
[]
[]
[]
[]
[]
[]
[]
[]
[]
[]
[]
[]
[]
[]
[]
[]
[]
[]
[]
[]
[]
[]
[]
[]
[]
[]
[]
[]
[]
[]
[]
[]
[]
[]
[]
[]
[]
[]
[]
[]
[]
[]
[]
[]
[]
[]
[]
[]
[]
[]
[]
[]
[]
[]
[]
[]
[]
[]
[]
[]
[]
[]
[]
[]
[]
[]
[]
[]
[]
[]
[]
[]
[]
[]
[]
[]
[]
[]
[]
[]
[]
[]
[]
[]
[]
[]
[]
[]
[]
[]
[]
[]
[]
[]
[]
[]
[]
[]
[]
[]
[]
[]
[]
[]
[]
[]
[]
[]
[]
[]
[]
[]
[]
[]
[]
[]
[]
[]
[]
[]
[]
[]
[]
[]
[]
[]
[]
[]
[]
[]
[]
[]
[]
[]
[]
[]
[]
[]
[]
[]
[]
[]
[]
[]
[]
[]
[]
[]
[]
[]
[]
[]
[]
[]
[]
[]
[]
[]
[]
[]
[]
[]
[]
[]
[]
[]
[]
[]
[]
[]
[]
[]
[]
[]
[]
[]
[]
[]
[]
[]
[]
[]
[]
[]
[]
[]
[]
[]
[]
[]
[]
[]
[]
[]
[]
[]
[]
[]
[]
[]
[]
[]
[]
[]
[]
[]
[]
[]
[]
[]
[]
[]
[]
[]
[]
[]
[]
[]
[]
[]
[]
[]
[]
[]
[]
[]
[]
[]
[]
[]
[]
[]
[]
[]
[]
[]
[]
[]
[]
[]
[]
[]
[]
[]
[]
[]
[]
[]
[]
[]
[]
[]
[]
[]
[]
[]
[]
[]
[]
[]
[]
[]
[]
[]
[]
[]
[]
[]
[]
[]
[]
[]
[]
[]
[]
[]
[]
[]
[]
[]
[]
[]
[]
[]
[]
[]
[]
[]
[]
[]
[]
[]
[]
[]
[]
[]
[]
[]
[]
[]
[]
[]
[]
[]
[]
[]
[]
[]
[]
[]
[]
[]
[]
[]
[]
[]
[]
[]
[]
[]
[]
[]
[]
[]
[]
[]
[]
[]
[]
[]
[]
[]
[]
[]
[]
[]
[]
[]
[]
[]
[]
[]
[]
[]
[]
[]
[]
[]
[]
[]
[]
[]
[]
[]
[]
[]
[]
[]
[]
[]
[]
[]
[]
[]
[]
[]
[]
[]
[]
[]
[]
[]
[]
[]
[]
[]
[]
[]
[]
[]
[]
[]
[]
[]
[]
[]
[]
[]
[]
[]
[]
[]
[]
[]
[]
[]
[]
[]
[]
[]
[]
[]
[]
[]
[]
[]
[]
[]
[]
[]
[]
[]
[]
[]
[]
[]
[]
[]
[]
[]
[]
[]
[]
[]
[]
[]
[]
[]
[]
[]
[]
[]
[]
[]
[]
[]
[]
[]
[]
[]
[]
[]
[]
[]
[]
[]
[]
[]
[]
[]
[]
[]
[]
[]
[]
[]
[]
[]
[]
[]
[]
[]
[]
[]
[]
[]
[]
[]
[]
[]
[]
[]
[]
[]
[]
[]
[]
[]
[]
[]
[]
[]
[]
[]
[]
[]
[]
[]
[]
[]
[]
[]
[]
[]
[]
[]
[]
[]
[]
[]
[]
[]
[]
[]
[]
[]
[]
[]
[]
[]
[]
[]
[]
[]
[]
[]
[]
[]
[]
[]
[]
[]
[]
[]
[]
[]
[]
[]
[]
[]
[]
[]
[]
[]
[]
[]
[]
[]
[]
[]
[]
[]
[]
[]
[]
[]
[]
[]
[]
[]
[]
[]
[]
[]
[]
[]
[]
[]
[]
[]
[]
[]
[]
[]
[]
[]
[]
[]
[]
[]
[]
[]
[]
[]
[]
[]
[]
[]
[]
[]
[]
[]
[]
[]
[]
[]
[]
[]
[]
[]
[]
[]
[]
[]
[]
[]
[]
[]
[]
[]
[]
[]
[]
[]
[]
[]
[]
[]
[]
[]
[]
[]
[]
[]
[]
[]
[]
[]
[]
[]
[]
[]
[]
[]
[]
[]
[]
[]
[]
[]
[]
[]
[]
[]
[]
[]
[]
[]
[]
[]
[]
[]
[]
[]
[]
[]
[]
[]
[]
[]
[]
[]
[]
[]
[]
[]
[]
[]
[]
[]
[]
[]
[]
[]
[]
[]
[]
[]
[]
[]
[]
[]
[]
[]
[]
[]
[]
[]
[]
[]
[]
[]
[]
[]
[]
[]
[]
[]
[]
[]
[]
[]
[]
[]
[]
[]
[]
[]
[]
[]
[]
[]
[]
[]
[]
[]
[]
[]
[]
[]
[]
[]
[]
[]
[]
[]
[]
[]
[]
[]
[]
[]
[]
[]
[]
[]
[]
[]
[]
[]
[]
[]
[]
[]
[]
[]
[]
[]
[]
[]
[]
[]
[]
[]
[]
[]
[]
[]
[]
[]
[]
[]
[]
[]
[]
[]
[]
[]
[]
[]
[]
[]
[]
[]
[]
[]
[]
[]
[]
[]
[]
[]
[]
[]
[]
[]
[]
[]
[]
[]
[]
[]
[]
[]
[]
[]
[]
[]
[]
[]
[]
[]
[]
[]
[]
[]
[]
[]
[]
[]
[]
[]
[]
[]
[]
[]
[]
[]
[]
[]
[]
[]
[]
[]
[]
[]
[]
[]
[]
[]
[]
[]
[]
[]
[]
[]
[]
[]
[]
[]
[]
[]
[]
[]
[]
[]
[]
[]
[]
[]
[]
[]
[]
[]
[]
[]
[]
[]
[]
[]
[]
[]
[]
[]
[]
[]
[]
[]
[]
[]
[]
[]
[]
[]
[]
[]
[]
[]
[]
[]
[]
[]
[]
[]
[]
[]
[]
[]
[]
[]
[]
[]
[]
[]
[]
[]
[]
[]
[]
[]
[]
[]
[]
[]
[]
[]
[]
[]
[]
[]
[]
[]
[]
[]
[]
[]
[]
[]
[]
[]
[]
[]
[]
[]
[]
[]
[]
[]
[]
[]
[]
[]
[]
[]
[]
[]
[]
[]
[]
[]
[]
[]
[]
[]
[]
[]
[]
[]
[]
[]
[]
[]
[]
[]
[]
[]
[]
[]
[]
[]
[]
[]
[]
[]
[]
[]
[]
[]
[]
[]
[]
[]
[]
[]
[]
[]
[]
[]
[]
[]
[]
[]
[]
[]
[]
[]
[]
[]
[]
[]
[]
[]
[]
[]
[]
[]
[]
[]
[]
[]
[]
[]
[]
[]
[]
[]
[]
[]
[]
[]
[]
[]
[]
[]
[]
[]
[]
[]
[]
[]
[]
[]
[]
[]
[]
[]
[]
[]
[]
[]
[]
[]
[]
[]
[]
[]
[]
[]
[]
[]
[]
[]
[]
[]
[]
[]
[]
[]
[]
[]
[]
[]
[]
[]
[]
[]
[]
[]
[]
[]
[]
[]
[]
[]
[]
[]
[]
[]
[]
[]
[]
[]
[]
[]
[]
[]
[]
[]
[]
[]
[]
[]
[]
[]
[]
[]
[]
[]
[]
[]
[]
[]
[]
[]
[]
[]
[]
[]
[]
[]
[]
[]
[]
[]
[]
[]
[]
[]
[]
[]
[]
[]
[]
[]
[]
[]
[]
[]
[]
[]
[]
[]
[]
[]
[]
[]
[]
[]
[]
[]
[]
[]
[]
[]
[]
[]
[]
[]
[]
[]
[]
[]
[]
[]
[]
[]
[]
[]
[]
[]
[]
[]
[]
[]
[]
[]
[]
[]
[]
[]
[]
[]
[]
[]
[]
[]
[]
[]
[]
[]
[]
[]
[]
[]
[]
[]
[]
[]
[]
[]
[]
[]
[]
[]
[]
[]
[]
[]
[]
[]
[]
[]
[]
[]
[]
[]
[]
[]
[]
[]
[]
[]
[]
[]
[]
[]
[]
[]
[]
[]
[]
[]
[]
[]
[]
[]
[]
[]
[]
[]
[]
[]
[]
[]
[]
[]
[]
[]
[]
[]
[]
[]
[]
[]
[]
[]
[]
[]
[]
[]
[]
[]
[]
[]
[]
[]
[]
[]
[]
[]
[]
[]
[]
[]
[]
[]
[]
[]
[]
[]
[]
[]
[]
[]
[]
[]
[]
[]
[]
[]
[]
[]
[]
[]
[]
[]
[]
[]
[]
[]
[]
[]
[]
[]
[]
[]
[]
[]
[]
[]
[]
[]
[]
[]
[]
[]
[]
[]
[]
[]
[]
[]
[]
[]
[]
[]
[]
[]
[]
[]
[]
[]
[]
[]
[]
[]
[]
[]
[]
[]
[]
[]
[]
[]
[]
[]
[]
[]
[]
[]
[]
[]
[]
[]
[]
[]
[]
[]
[]
[]
[]
[]
[]
[]
[]
[]
[]
[]
[]
[]
[]
[]
[]
[]
[]
[]
[]
[]
[]
[]
[]
[]
[]
[]
[]
[]
[]
[]
[]
[]
[]
[]
[]
[]
[]
[]
[]
[]
[]
[]
[]
[]
[]
[]
[]
[]
[]
[]
[]
[]
[]
[]
[]
[]
[]
[]
[]
[]
[]
[]
[]
[]
[]
[]
[]
[]
[]
[]
[]
[]
[]
[]
[]
[]
[]
[]
[]
[]
[]
[]
[]
[]
[]
[]
[]
[]
[]
[]
[]
[]
[]
[]
[]
[]
[]
[]
[]
[]
[]
[]
[]
[]
[]
[]
[]
[]
[]
[]
[]
[]
[]
[]
[]
[]
[]
[]
[]
[]
[]
[]
[]
[]
[]
[]
[]
[]
[]
[]
[]
[]
[]
[]
[]
[]
[]
[]
[]
[]
[]
[]
[]
[]
[]
[]
[]
[]
[]
[]
[]
[]
[]
[]
[]
[]
[]
[]
[]
[]
[]
[]
[]
[]
[]
[]
[]
[]
[]
[]
[]
[]
[]
[]
[]
[]
[]
[]
[]
[]
[]
[]
[]
[]
[]
[]
[]
[]
[]
[]
[]
[]
[]
[]
[]
[]
[]
[]
[]
[]
[]
[]
[]
[]
[]
[]
[]
[]
[]
[]
[]
[]
[]
[]
[]
[]
[]
[]
[]
[]
[]
[]
[]
[]
[]
[]
[]
[]
[]
[]
[]
[]
[]
[]
[]
[]
[]
[]
[]
[]
[]
[]
[]
[]
[]
[]
[]
[]
[]
[]
[]
[]
[]
[]
[]
[]
[]
[]
[]
[]
[]
[]
[]
[]
[]
[]
[]
[]
[]
[]
[]
[]
[]
[]
[]
[]
[]
[]
[]
[]
[]
[]
[]
[]
[]
[]
[]
[]
[]
[]
[]
[]
[]
[]
[]
[]
[]
[]
[]
[]
[]
[]
[]
[]
[]
[]
[]
[]
[]
[]
[]
[]
[]
[]
[]
[]
[]
[]
[]
[]
[]
[]
[]
[]
[]
[]
[]
[]
[]
[]
[]
[]
[]
[]
[]
[]
[]
[]
[]
[]
[]
[]
[]
[]
[]
[]
[]
[]
[]
[]
[]
[]
[]
[]
[]
[]
[]
[]
[]
[]
[]
[]
[]
[]
[]
[]
[]
[]
[]
[]
[]
[]
[]
[]
[]
[]
[]
[]
[]
[]
[]
[]
[]
[]
[]
[]
[]
[]
[]
[]
[]
[]
[]
[]
[]
[]
[]
[]
[]
[]
[]
[]
[]
[]
[]
[]
[]
[]
[]
[]
[]
[]
[]
[]
[]
[]
[]
[]
[]
[]
[]
[]
[]
[]
[]
[]
[]
[]
[]
[]
[]
[]
[]
[]
[]
[]
[]
[]
[]
[]
[]
[]
[]
[]
[]
[]
[]
[]
[]
[]
[]
[]
[]
[]
[]
[]
[]
[]
[]
[]
[]
[]
[]
[]
[]
[]
[]
[]
[]
[]
[]
[]
[]
[]
[]
[]
[]
[]
[]
[]
[]
[]
[]
[]
[]
[]
[]
[]
[]
[]
[]
[]
[]
[]
[]
[]
[]
[]
[]
[]
[]
[]
[]
[]
[]
[]
[]
[]
[]
[]
[]
[]
[]
[]
[]
[]
[]
[]
[]
[]
[]
[]
[]
[]
[]
[]
[]
[]
[]
[]
[]
[]
[]
[]
[]
[]
[]
[]
[]
[]
[]
[]
[]
[]
[]
[]
[]
[]
[]
[]
[]
[]
[]
[]
[]
[]
[]
[]
[]
[]
[]
[]
[]
[]
[]
[]
[]
[]
[]
[]
[]
[]
[]
[]
[]
[]
[]
[]
[]
[]
[]
[]
[]
[]
[]
[]
[]
[]
[]
[]
[]
[]
[]
[]
[]
[]
[]
[]
[]
[]
[]
[]
[]
[]
[]
[]
[]
[]
[]
[]
[]
[]
[]
[]
[]
[]
[]
[]
[]
[]
[]
[]
[]
[]
[]
[]
[]
[]
[]
[]
[]
[]
[]
[]
[]
[]
[]
[]
[]
[]
[]
[]
[]
[]
[]
[]
[]
[]
[]
[]
[]
[]
[]
[]
[]
[]
[]
[]
[]
[]
[]
[]
[]
[]
[]
[]
[]
[]
[]
[]
[]
[]
[]
[]
[]
[]
[]
[]
[]
[]
[]
[]
[]
[]
[]
[]
[]
[]
[]
[]
[]
[]
[]
[]
[]
[]
[]
[]
[]
[]
[]
[]
[]
[]
[]
[]
[]
[]
[]
[]
[]
[]
[]
[]
[]
[]
[]
[]
[]
[]
[]
[]
[]
[]
[]
[]
[]
[]
[]
[]
[]
[]
[]
[]
[]
[]
[]
[]
[]
[]
[]
[]
[]
[]
[]
[]
[]
[]
[]
[]
[]
[]
[]
[]
[]
[]
[]
[]
[]
[]
[]
[]
[]
[]
[]
[]
[]
[]
[]
[]
[]
[]
[]
[]
[]
[]
[]
[]
[]
[]
[]
[]
[]
[]
[]
[]
[]
[]
[]
[]
[]
[]
[]
[]
[]
[]
[]
[]
[]
[]
[]
[]
[]
[]
[]
[]
[]
[]
[]
[]
[]
[]
[]
[]
[]
[]
[]
[]
[]
[]
[]
[]
[]
[]
[]
[]
[]
[]
[]
[]
[]
[]
[null,null,null,null,null,null,null,null,"kukoU19K%o71B%eMel34Ye!Mak83H!Ae24fW970k00SufoJ&!TOpsı1!32nekazilar&&Mavgak&%5pD2!liSh%"]

{"sheet":"Lapse 10_20 Tabloxer ORJ (2)","index":1,"n_rows":142,"n_cols":10,"rows_kept":142,"cut":false,"hidden":false,"merged":[[2,6,3,7]]}
[]
[]
[null,null,"PÇAĞE","ĹAPSE 10 (ĆE)","ĹAPSE 20 (JI)",null,"ĹAPSE 10 ",null,null,77125]
[null,null,1,"zı","zı",null,null,null,null,440832]
[null,null,2,"ṫu","ṫ`u",null,"1 ….. 10","zı ….. zıć",null,3988014]
[null,null,3,"şı","şı",null,"2 ….. 20"," ṫu ….. ṫuć",null,33582651]
[null,null,4,"pĺ`ı","pĺ`ı",null,"3 ….. 30","şı ….. şıć",null,8300012007]
[null,null,5,"tfı","tfı",null,"4 ….. 40"," pıĺ`ı ….. pıĺ`ıć ",null,50012376498]
[null,null,6,"xı","xı",null,"5 ….. 50"," tfı ….. tfıć  ",null,987234653123]
[null,null,7,"blı","blı",null,"6 ….. 60"," xı ….. xıć ",null,85462001764122]
[null,null,8,"yi","yi",null,"7 ….. 70"," blı ….. blıć ",null,106773892053155]
[null,null,9,"bğu","bğu",null,"8 ….. 80","yi ….. yić  "]
[null,null,10,"zıć ","pş`ı",null,"9 ….. 90"," bğu ….. bğuć  "]
[]
[null,null,"PÇAĞE","ĹAPSE 10 (ĆE)","ĹAPSE 20 (JI)"]
[null,null,11,"zıć  zı","pş`ıqu`ız"]
[null,null,12,"zıć  ṫu","pş`ıquṫ`u"]
[null,null,13,"zıć  şı","pş`ıquş"]
[null,null,14,"zıć  pĺ`ı","pş`ıqupĺ`ı"]
[null,null,15,"zıć  tfı","pş`ıqutfı"]
[null,null,16,"zıć  xı","pş`ıquxı"]
[null,null,17,"zıć  blı","pş`ıqubl"]
[null,null,18,"zıć  yi","pş`ıquyi"]
[null,null,19,"zıć  bğu","pş`ıqubğu"]
[null,null,20,"ṫuć","ṫ`oć"]
[]
[null,null,"PÇAĞE","ĹAPSE 10 (ĆE)","ĹAPSE 20 (JI)"]
[null,null,20,"ṫuć","ṫ`oć"]
[null,null,21,"ṫuć zı","ṫ`oćre zıre"]
[null,null,22,"ṫuć ṫu","ṫ`oćre ṫ`ure"]
[null,null,23,"ṫuć şı","ṫ`oćıre ş`ıre"]
[null,null,24,"ṫuć pĺ`ı","ṫ`oćıre pĺ`ıre"]
[null,null,25,"ṫuć tfı","ṫ`oćıre tfıre"]
[null,null,26,"ṫuć xı","ṫ`oćıre xıre"]
[null,null,27,"ṫuć blı","ṫ`oćıre blıre"]
[null,null,28,"ṫuć yi","ṫ`oćıre yire"]
[null,null,29,"ṫuć bğu","ṫ`oćıre bğure"]
[null,null,30,"şıć","ṫ`oćıre pş`ıre"]
[]
[null,null,"SAYI","10 lu SİSTEM","20 Lİ SİSTEM"]
[null,null,30,"şıć","ṫ`oćıre pş`ıre"]
[null,null,31,"şıć zı","ṫ`oćıre pş`ıquzıre"]
[null,null,32,"şıć ṫu","ṫ`oćıre pş`ıquṫ`ure"]
[null,null,33,"şıć şı","ṫ`oćıre pş`ıquşre"]
[null,null,34,"şıć pĺ`ı","ṫ`oćıre pş`ıqupĺ`ıre"]
[null,null,35,"şıć tfı","ṫ`oćıre pş`ıqutfıre"]
[null,null,36,"şıć xı","ṫ`oćıre pş`ıquxıre"]
[null,null,37,"şıć blı","ṫ`oćıre pş`ıqublıre"]
[null,null,38,"şıć yi","ṫ`oćıre pş`ıquyire"]
[null,null,39,"şıć bğu","ṫ`oćıre pş`ıqubğure"]
[null,null,40,"pĺ`ıć ","ṫ`oćiṫ`u"]
[]
[null,null,"PÇAĞE","ĹAPSE 10 (ĆE)","ĹAPSE 20 (JI)"]
[null,null,40,"pĺ`ıć ","ṫ`oćiṫ`u"]
[null,null,41,"pĺ`ıć zı","ṫ`oćiṫ`ure zıre"]
[null,null,42,"pĺ`ıć ṫu","ṫ`oćiṫ`ure ṫ`ure"]
[null,null,43,"pĺ`ıć şı","ṫ`oćiṫ`ure şıre"]
[null,null,44,"pĺ`ıć pĺ`ı","ṫ`oćiṫ`ure pĺ`ıre"]
[null,null,45,"pĺ`ıć tfı","ṫ`oćiṫ`ure tfıre"]
[null,null,46,"pĺ`ıć xı","ṫ`oćiṫ`ure xıre"]
[null,null,47,"pĺ`ıć blı","ṫ`oćiṫ`ure blıre"]
[null,null,48,"pĺ`ıć yi","ṫ`oćiṫ`ure yire"]
[null,null,49,"pĺ`ıć bğu","ṫ`oćiṫ`ure bğure"]
[null,null,50,"tfıć  ","ṫ`oćiṫ`ure pş`ıre"]
[]
[null,null,"PÇAĞE","ĹAPSE 10 (ĆE)","ĹAPSE 20 (JI)"]
[null,null,50,"tfıć  ","ṫ`oćiṫ`ure pş`ıre"]
[null,null,51,"tfıć  zı","ṫ`oćiṫ`ure pş`ıquzıre"]
[null,null,52,"tfıć  ṫu","ṫ`oćiṫ`ure pş`ıquṫ`ure"]
[null,null,53,"tfıć  şı","ṫ`oćiṫ`ure pş`ıquşre"]
[null,null,54,"tfıć  pĺ`ı","ṫ`oćiṫ`ure pş`ıqupĺ`ıre"]
[null,null,55,"tfıć  tfı","ṫ`oćiṫ`ure pş`ıqutfıre"]
[null,null,56,"tfıć  xı","ṫ`oćiṫ`ure pş`ıquxıre"]
[null,null,57,"tfıć  blı","ṫ`oćiṫ`ure pş`ıqublıre"]
[null,null,58,"tfıć  yi","ṫ`oćiṫ`ure pş`ıquyire"]
[null,null,59,"tfıć  bğu","ṫ`oćiṫ`ure pş`ıqubğure"]
[null,null,60,"xıć ","ṫ`oćiş"]
[]
[null,null,"PÇAĞE","ĹAPSE 10 (ĆE)","ĹAPSE 20 (JI)"]
[null,null,60,"xıć ","ṫ`oćiş"]
[null,null,61,"xıć  zı","ṫ`oćişre zıre"]
[null,null,62,"xıć  ṫu","ṫ`oćişre ṫ`ure"]
[null,null,63,"xıć  şı","ṫ`oćişre şıre"]
[null,null,64,"xıć  pĺ`ı","ṫ`oćişre pĺ`ıre"]
[null,null,65,"xıć  tfı","ṫ`oćişre tfıre"]
[null,null,66,"xıć  xı","ṫ`oćişre xıre"]
[null,null,67,"xıć  blı","ṫ`oćişre blıre"]
[null,null,68,"xıć  yi","ṫ`oćişre yire"]
[null,null,69,"xıć  bğu","ṫ`oćişre bğure"]
[null,null,70,"blıć ","ṫ`oćişre pş`ıre"]
[]
[null,null,"PÇAĞE","ĹAPSE 10 (ĆE)","ĹAPSE 20 (JI)"]
[null,null,70,"blıć ","ṫ`oćişre pş`ıre"]
[null,null,71,"blıć zı","ṫ`oćişre pş`ıquzıre"]
[null,null,72,"blıć ṫu","ṫ`oćişre pş`ıquṫ`ure"]
[null,null,73,"blıć şı","ṫ`oćişre pş`ıquşre"]
[null,null,74,"blıć pĺ`ı","ṫ`oćişre pş`ıqupĺ`ıre"]
[null,null,75,"blıć tfı","ṫ`oćişre pş`ıqutfıre"]
[null,null,76,"blıć xı","ṫ`oćişre pş`ıquxıre"]
[null,null,77,"blıć blı","ṫ`oćişre pş`ıqubĺıre"]
[null,null,78,"blıć yi","ṫ`oćişre pş`ıquyire"]
[null,null,79,"blıć bğu","ṫ`oćişre pş`ıqubğure"]
[null,null,80,"yić  ","ṫ`oćipĺ`ı"]
[]
[null,null,"PÇAĞE","ĹAPSE 10 (ĆE)","ĹAPSE 20 (JI)"]
[null,null,80,"yić  ","ṫ`oćipĺ`ı"]
[null,null,81,"yić  zı","ṫ`oćipĺ`ıre zıre"]
[null,null,82,"yić  ṫu","ṫ`oćipĺ`ıre ṫ`ure"]
[null,null,83,"yić  şı","ṫ`oćipĺ`ıre şıre"]
[null,null,84,"yić  pĺ`ı","ṫ`oćipĺ`ıre pĺ`ıre"]
[null,null,85,"yić  tfı","ṫ`oćipĺ`ıre tfıre"]
[null,null,86,"yić  xı","ṫ`oćipĺ`ıre xıre"]
[null,null,87,"yić  blı","ṫ`oćipĺ`ıre blıre"]
[null,null,88,"yić  yi","ṫ`oćipĺ`ıre yire"]
[null,null,89,"yić  bğu","ṫ`oćipĺ`ıre bğure"]
[null,null,90,"bğuć  ","ṫ`oćipĺ`ıre pş`ıre"]
[]
[null,null,"PÇAĞE","ĹAPSE 10 (ĆE)","ĹAPSE 20 (JI)"]
[null,null,90,"bğuć  ","ṫ`oćipĺ`ıre pş`ıre"]
[null,null,91,"bğuć  zı","ṫ`oćipĺ`ıre pş`ıquzıre"]
[null,null,92,"bğuć  ṫu","ṫ`oćipĺ`ıre pş`ıquṫ`ure"]
[null,null,93,"bğuć  şı","ṫ`oćipĺ`ıre pş`ıquşre"]
[null,null,94,"bğuć  pĺ`ı","ṫ`oćipĺ`ıre pş`ıqupĺ`ıre"]
[null,null,95,"bğuć  tfı","ṫ`oćipĺ`ıre pş`ıqutfıre"]
[null,null,96,"bğuć  xı","ṫ`oćipĺ`ıre pş`ıquxıre"]
[null,null,97,"bğuć  blı","ṫ`oćipĺ`ıre pş`ıqublıre"]
[null,null,98,"bğuć  yi","ṫ`oćipĺ`ıre pş`ıquyire"]
[null,null,99,"bğuć  bğu","ṫ`oćipĺ`ıre pş`ıqubğure"]
[null,null,100,"şe ","şe"]
[]
[null,null,"PÇAĞE","ĹAPSE 10 (ĆE)","ĹAPSE 20 (JI)"]
[null,null,100,"şe ","şe"]
[null,null,101,"şe zı","şere zıre"]
[null,null,102,"şe ṫu","şere ṫ`ure"]
[null,null,103,"şe şı","şere şıre"]
[null,null,104,"şe pĺ`ı","şere pĺ`ıre"]
[null,null,105,"şe tfı","şere tfıre"]
[null,null,106,"şe xı","şere xıre"]
[null,null,107,"şe blı","şere blıre"]
[null,null,108,"şe yi","şere yire"]
[null,null,109,"şe bğu","şere bğure"]
[null,null,110,"şe zıć","şere pş`ıre"]

{"sheet":"tablo","index":2,"n_rows":106,"n_cols":9,"rows_kept":106,"cut":false,"hidden":true,"merged":[[0,1,0,3],[0,7,0,9],[1,7,1,9]]}
[null,"ONLU ve YİRMİLİ  sayı sistemlerinin kıyaslanması",null,null,null,null,null,199273055133677]
[null,null,null,null,null,null,null,119273045133667]
[null,"RAKAM","ONLU SİSTEM","YİRMİLİ SİSTEM"]
[null,0,"ziy","zıriy",null,null,null,null,"Şe Bğuć Bğu Trimelvan Ṫu Şe Blıć Şı Milyar Tfıć Tfı Melwan Şe Şıć Şı Min Xı Şe Blıć Blı"]
[null,1,"zı","zı",null,null,null,null,"Şe Bğupş`ı Bğu Trimelvan T'`u Şe Blıḉ Şı Milyar Tfıpş`ı Tfı Melwan Şe Şıpş`ı Şı Min Xı Şe Blıḉ Blı"]
[null,2,"ṫu","Ṫu",null,null,null,null,"Şere Ṫoćipĺ`ıre Pş'ıqubğure Trimelvanre Şiṫure Ṫoćişre Pş'ıquşıre  Milyarre Ṫoćiṫure Pş'ıqutfıre Melwanre Şere Ṫoćıre Pş'ıquşıre Minıre Şixıre Ṫoćişre Pş'ıqubĺıre"]
[null,3,"şı","şı"]
[null,4,"pĺ`ı","pĺ`ı"]
[null,5,"tfı","tfı"]
[null,6,"xı","xı"]
[null,7,"blı","blı"]
[null,8,"yi","yi"]
[null,9,"bğu","bğu"]
[null,10,"Zıć","Pş'ı"]
[null,11,"Zıć zı","Pş'ıqu`ız"]
[null,12,"Zıć ṫu","Pş'ıquṫu"]
[null,13,"Zıć şı","Pş'ıquş"]
[null,14,"Zıć pĺ`ı","Pş'ıqupĺ`ı"]
[null,15,"Zıć tfı","Pş'ıqutfı"]
[null,16,"Zıć xı","Pş'ıquxı"]
[null,17,"Zıć blı","Pş'ıqubl"]
[null,18,"Zıć yi","Pş'ıquyi"]
[null,19,"Zıć bğu","Pş'ıqubğu"]
[null,20,"ṫuć","Ṫoć"]
[null,21,"ṫuć zı","Ṫoćre Zıre"]
[null,22,"ṫuć ṫu","Ṫoćre Ṫure"]
[null,23,"ṫuć şı","Ṫoćıre Şıre"]
[null,24,"ṫuć pĺ`ı","Ṫoćıre Pĺ`ıre"]
[null,25,"ṫuć tfı","Ṫoćıre Tfıre"]
[null,26,"ṫuć xı","Ṫoćıre Xıre"]
[null,27,"ṫuć blı","Ṫoćıre Blıre"]
[null,28,"ṫuć yi","Ṫoćıre Yire"]
[null,29,"ṫuć bğu","Ṫoćıre Bğure"]
[null,30,"şıć","Ṫoćıre Pş'ıre"]
[null,31,"şıć zı","Ṫoćıre Pş'ıquzıre"]
[null,32,"şıć ṫu","Ṫoćıre Pş'ıquṫure"]
[null,33,"şıć şı","Ṫoćıre Pş'ıquşre"]
[null,34,"şıć pĺ`ı","Ṫoćıre Pş'ıqupĺ`ıre"]
[null,35,"şıć tfı","Ṫoćıre Pş'ıqutfıre"]
[null,36,"şıć xı","Ṫoćıre Pş'ıquxıre"]
[null,37,"şıć blı","Ṫoćıre Pş'ıqublıre"]
[null,38,"şıć yi","Ṫoćıre Pş'ıquyire"]
[null,39,"şıć bğu","Ṫoćıre Pş'ıqubğure"]
[null,40,"pĺ`ıć ","Ṫoćiṫu"]
[null,41,"pĺ`ıć zı","Ṫoćiṫure Zıre"]
[null,42,"pĺ`ıć ṫu","Ṫoćiṫure Ṫure"]
[null,43,"pĺ`ıć şı","Ṫoćiṫure Şıre"]
[null,44,"pĺ`ıć pĺ`ı","Ṫoćiṫure Pĺ`ıre"]
[null,45,"pĺ`ıć tfı","Ṫoćiṫure Tfıre"]
[null,46,"pĺ`ıć xı","Ṫoćiṫure Xıre"]
[null,47,"pĺ`ıć blı","Ṫoćiṫure Blıre"]
[null,48,"pĺ`ıć yi","Ṫoćiṫure Yire"]
[null,49,"pĺ`ıć bğu","Ṫoćiṫure Bğure"]
[null,50,"tfıć  ","Ṫoćiṫure Pş'ıre"]
[null,51,"tfıć  zı","Ṫoćiṫure Pş'ıquzıre"]
[null,52,"tfıć  ṫu","Ṫoćiṫure Pş'ıquṫure"]
[null,53,"tfıć  şı","Ṫoćiṫure Pş'ıquşre"]
[null,54,"tfıć  pĺ`ı","Ṫoćiṫure Pş'ıqupĺ`ıre"]
[null,55,"tfıć  tfı","Ṫoćiṫure Pş'ıqutfıre"]
[null,56,"tfıć  xı","Ṫoćiṫure Pş'ıquxıre"]
[null,57,"tfıć  blı","Ṫoćiṫure Pş'ıqublıre"]
[null,58,"tfıć  yi","Ṫoćiṫure Pş'ıquyire"]
[null,59,"tfıć  bğu","Ṫoćiṫure Pş'ıqubğure"]
[null,60,"xıć ","Ṫoćiş"]
[null,61,"xıć  zı","Ṫoćişre Zıre"]
[null,62,"xıć  ṫu","Ṫoćişre Ṫure"]
[null,63,"xıć  şı","Ṫoćişre Şıre"]
[null,64,"xıć  pĺ`ı","Ṫoćişre Pĺ`ıre"]
[null,65,"xıć  tfı","Ṫoćişre Tfıre"]
[null,66,"xıć  xı","Ṫoćişre Xıre"]
[null,67,"xıć  blı","Ṫoćişre Blıre"]
[null,68,"xıć  yi","Ṫoćişre Yire"]
[null,69,"xıć  bğu","Ṫoćişre Bğure"]
[null,70,"blıć ","Ṫoćişre Pş'ıre"]
[null,71,"blıć zı","Ṫoćişre Pş'ıquzıre"]
[null,72,"blıć ṫu","Ṫoćişre Pş'ıquṫure"]
[null,73,"blıć şı","Ṫoćişre Pş'ıquşre"]
[null,74,"blıć pĺ`ı","Ṫoćişre Pş'ıqupĺ`ıre"]
[null,75,"blıć tfı","Ṫoćişre Pş'ıqutfıre"]
[null,76,"blıć xı","Ṫoćişre Pş'ıquxıre"]
[null,77,"blıć blı","Ṫoćişre Pş'ıqubĺıre"]
[null,78,"blıć yi","Ṫoćişre Pş'ıquyire"]
[null,79,"blıć bğu","Ṫoćişre Pş'ıqubğure"]
[null,80,"yić  ","Ṫoćipĺ`ı"]
[null,81,"yić  zı","Ṫoćipĺ`ıre Zıre"]
[null,82,"yić  ṫu","Ṫoćipĺ`ıre Ṫure"]
[null,83,"yić  şı","Ṫoćipĺ`ıre Şıre"]
[null,84,"yić  pĺ`ı","Ṫoćipĺ`ıre Pĺ`ıre"]
[null,85,"yić  tfı","Ṫoćipĺ`ıre Tfıre"]
[null,86,"yić  xı","Ṫoćipĺ`ıre Xıre"]
[null,87,"yić  blı","Ṫoćipĺ`ıre Blıre"]
[null,88,"yić  yi","Ṫoćipĺ`ıre Yire"]
[null,89,"yić  bğu","Ṫoćipĺ`ıre Bğure"]
[null,90,"bğuć  ","Ṫoćipĺ`ıre Pş'ıre"]
[null,91,"bğuć  zı","Ṫoćipĺ`ıre Pş'ıquzıre"]
[null,92,"bğuć  ṫu","Ṫoćipĺ`ıre Pş'ıquṫure"]
[null,93,"bğuć  şı","Ṫoćipĺ`ıre Pş'ıquşre"]
[null,94,"bğuć  pĺ`ı","Ṫoćipĺ`ıre Pş'ıqupĺ`ıre"]
[null,95,"bğuć  tfı","Ṫoćipĺ`ıre Pş'ıqutfıre"]
[null,96,"bğuć  xı","Ṫoćipĺ`ıre Pş'ıquxıre"]
[null,97,"bğuć  blı","Ṫoćipĺ`ıre Pş'ıqublıre"]
[null,98,"bğuć  yi","Ṫoćipĺ`ıre Pş'ıquyire"]
[null,99,"bğuć  bğu","Ṫoćipĺ`ıre Pş'ıqubğure"]
[null,100,"şe ","Şe"]
[null,1000,"min","min"]
[null,1000000,"melwan","melwan"]

{"sheet":"10","index":3,"n_rows":43,"n_cols":18,"rows_kept":43,"cut":false,"hidden":true,"merged":[]}
[null,{"$f":"PÇAĞE!B3:D3","v":199273055133677}]
[null,{"$f":"D9&\" \"&D14&\" \"&D19&\" \"&D24&\" \"&D28","v":" Şe Bğuć Bğu Trilyon Ṫu Şe Blıć Şı Milyar   Tfıć Tfı Milyon  Şe Şıć Şı Min Xı Şe Blıć Blı"}]
[null,{"$f":"IF(NJ<1000000000000000,B2,\"L'ıtağer 999.999.999.999.999 neh' s''ıqu h'un fay\")","v":" Şe Bğuć Bğu Trilyon Ṫu Şe Blıć Şı Milyar   Tfıć Tfı Milyon  Şe Şıć Şı Min Xı Şe Blıć Blı"}]
[null,{"$f":"IF(NJ=0,\"ziy\",B3)","v":" Şe Bğuć Bğu Trilyon Ṫu Şe Blıć Şı Milyar   Tfıć Tfı Milyon  Şe Şıć Şı Min Xı Şe Blıć Blı"}]
[{"$f":"(MOD(NJ,10^115)-MOD(NJ,10^14))/10^14","v":1},{"$f":"IF(A5=1,\"\",VLOOKUP(A5,$E$6:$F$38,2))","v":""},{"$f":"IF(B5=0,\"\",B5)","v":""}]
[{"$f":"IF(A5=0,\"\",H)","v":"Şe"},null,{"$f":"A6","v":"Şe"},null,0,0]
[{"$f":"(MOD(NJ,10^14)-MOD(NJ,10^13))/10^12","v":90},{"$f":"VLOOKUP(A7,$E$6:$F$38,2)","v":"Bğuć"},{"$f":"IF(B7=0,\"\",B7)","v":"Bğuć"},null,1,"Zı"]
[{"$f":"(MOD(NJ,10^13)-MOD(NJ,10^12))/10^12","v":9},{"$f":"VLOOKUP(A8,$E$6:$F$38,2)","v":"Bğu"},{"$f":"IF(B8=0,\"\",B8)","v":"Bğu"},null,2,"Ṫu"]
[{"$f":"IF(AND(A5=\"\",A7=\"\",A8=\"\"),\"\",IF(AND(A5=0,A7=0,A8=0),\"\",MLL))","v":"Trilyon"},null,{"$f":"IF(NJ<999999999,\"\",A9)","v":"Trilyon"},{"$f":"C5&\" \"&C6&\" \"&C7&\" \"&C8&\" \"&C9","v":" Şe Bğuć Bğu Trilyon"},3,"Şı"]
[{"$f":"(MOD(NJ,10^12)-MOD(NJ,10^11))/10^11","v":2},{"$f":"IF(A10=1,\"\",VLOOKUP(A10,$E$6:$F$38,2))","v":"Ṫu"},{"$f":"IF(B10=0,\"\",B10)","v":"Ṫu"},null,4,"Pĺ`ı"]
[{"$f":"IF(A10=0,\"\",H)","v":"Şe"},null,{"$f":"A11","v":"Şe"},null,5,"Tfı"]
[{"$f":"(MOD(NJ,10^11)-MOD(NJ,10^10))/10^9","v":70},{"$f":"VLOOKUP(A12,$E$6:$F$38,2)","v":"Blıć"},{"$f":"IF(B12=0,\"\",B12)","v":"Blıć"},null,6,"Xı"]
[{"$f":"(MOD(NJ,10^10)-MOD(NJ,10^9))/10^9","v":3},{"$f":"VLOOKUP(A13,$E$6:$F$38,2)","v":"Şı"},{"$f":"IF(B13=0,\"\",B13)","v":"Şı"},null,7,"Blı"]
[{"$f":"IF(AND(A10=\"\",A12=\"\",A13=\"\"),\"\",IF(AND(A10=0,A12=0,A13=0),\"\",ML))","v":"Milyar"},null,{"$f":"IF(NJ<999999999,\"\",A14)","v":"Milyar"},{"$f":"C10&\" \"&C11&\" \"&C12&\" \"&C13&\" \"&C14","v":"Ṫu Şe Blıć Şı Milyar"},8,"Yi"]
[{"$f":"(MOD(NJ,10^9)-MOD(NJ,10^8))/10^8","v":0},{"$f":"IF(A15=1,\"\",VLOOKUP(A15,$E$6:$F$38,2))","v":0},{"$f":"IF(B15=0,\"\",B15)","v":""},null,9,"Bğu"]
[{"$f":"IF(A15=0,\"\",H)","v":""},null,{"$f":"A16","v":""},null,10,"Zıć"]
[{"$f":"(MOD(NJ,10^8)-MOD(NJ,10^7))/10^6","v":50},{"$f":"VLOOKUP(A17,$E$6:$F$38,2)","v":"Tfıć"},{"$f":"IF(B17=0,\"\",B17)","v":"Tfıć"},null,11,"Zıć zı"]
[{"$f":"(MOD(NJ,10^7)-MOD(NJ,10^6))/10^6","v":5},{"$f":"VLOOKUP(A18,$E$6:$F$38,2)","v":"Tfı"},"Tfı",null,12,"Zıć ṫ`u"]
[{"$f":"IF(AND(A15=\"\",A17=\"\",A18=\"\"),\"\",IF(AND(A15=0,A17=0,A18=0),\"\",M))","v":"Milyon"},null,{"$f":"IF(NJ<999999,\"\",A19)","v":"Milyon"},{"$f":"C15&\" \"&C16&\" \"&C17&\" \"&C18&\" \"&C19","v":"  Tfıć Tfı Milyon"},13,"Zıć şı"]
[{"$f":"(MOD(NJ,10^6)-MOD(NJ,10^5))/10^5","v":1},{"$f":"IF(A20=1,\"\",VLOOKUP(A20,$E$6:$F$38,2))","v":""},{"$f":"IF(B20=0,\"\",B20)","v":""},null,14,"Zıć pĺ`ı"]
[{"$f":"IF(A20=0,\"\",H)","v":"Şe"},null,{"$f":"A21","v":"Şe"},null,15,"Zıć tfı"]
[{"$f":"(MOD(NJ,10^5)-MOD(NJ,10^4))/10^3","v":30},{"$f":"VLOOKUP(A22,$E$6:$F$38,2)","v":"Şıć"},{"$f":"IF(B22=0,\"\",B22)","v":"Şıć"},null,16,"Zıć xı"]
[{"$f":"(MOD(NJ,10^4)-MOD(NJ,10^3))/10^3","v":3},{"$f":"IF(NJ>1999,VLOOKUP(A23,$E$6:$F$38,2),\"\")","v":"Şı"},{"$f":"IF(B23=0,\"\",B23)","v":"Şı"},null,17,"Zıć blı"]
[{"$f":"IF(AND(A20=\"\",A22=\"\",A23=\"\"),\"\",IF(AND(A20=0,A22=0,A23=0),\"\",K))","v":"Min"},null,{"$f":"IF(NJ<999,\"\",A24)","v":"Min"},{"$f":"C20&\" \"&C21&\" \"&C22&\" \"&C23&\" \"&C24","v":" Şe Şıć Şı Min"},18,"Zıć yi"]
[{"$f":"(RIGHT(NJ,3)-RIGHT(NJ,2))/100","v":6},{"$f":"IF(A25=1,\"\",(VLOOKUP(A25,$E$6:$F$38,2)))","v":"Xı"},{"$f":"IF(B25=0,\"\",B25)","v":"Xı"},null,19,"Zıć bğu"]
[{"$f":"IF(A25=0,\"\",H)","v":"Şe"},null,{"$f":"A26","v":"Şe"},null,20,"Ṫuć",null,null,null,null,null,null,null,{"$f":"IF(OR(#REF!=0,#REF!=\"\"),\"\",#REF!)","v":{"$error":"#REF!"}}]
[{"$f":"RIGHT(NJ,2)-RIGHT(NJ,1)","v":70},{"$f":"VLOOKUP(A27,$E$6:$F$38,2)","v":"Blıć"},{"$f":"IF(B27=0,\"\",B27)","v":"Blıć"},null,30,"Şıć"]
[{"$f":"RIGHT(NJ,1)*1","v":7},{"$f":"VLOOKUP(A28,$E$6:$F$38,2)","v":"Blı"},{"$f":"IF(B28=0,\"\",B28)","v":"Blı"},{"$f":"C25&\" \"&C26&\" \"&C27&\" \"&C28","v":"Xı Şe Blıć Blı"},40,{"$f":"IF(N1=40,\"Pıĺ`ć\",\"Pĺ`ıć\")","v":"Pĺ`ıć"}]
[null,null,null,null,50,{"$f":"IF(N1=50,\"Tfıć\",\"Tfıć\")","v":"Tfıć"}]
[146198145613275,{"$f":"VLOOKUP(A28,$E$7:$F$39,2)","v":"Blı"},null,null,60,{"$f":"IF(N1=60,\"Xıć\",\"Xıć\")","v":"Xıć"}]
[{"$f":"MOD(A30,100)-MOD(A30,10)","v":{"$error":"#NUM!"}},{"$f":"IF(A25=1,\"\",(VLOOKUP(A25,$E$6:$F$38,2)))","v":"Xı"},null,{"$f":"IF(ROUND(MOD(MOD(NJ,10),1),2)>0.2,VLOOKUP(ROUND(MOD(MOD(NJ,10),0.1),2)*100,TJ,2),\"\")","v":{"$error":"#NUM!"}},70,{"$f":"IF(N1=70,\"Blıć\",\"Blıć\")","v":"Blıć"}]
[null,null,null,{"$f":"IF(MOD(MOD(NJ,10),1)>0,SJ,\"\")&IF(ROUND(MOD(MOD(NJ,10),1),2)>0.01,\"s\",\"\")","v":{"$error":"#NUM!"}},80,{"$f":"IF(N1=80,\"Yić\",\"Yić\")","v":"Yić"}]
[{"$f":"MOD(A30,10)","v":{"$error":"#NUM!"}},{"$f":"A28*1","v":7},{"$f":"VLOOKUP(B33,$E$6:$F$38,2)","v":"Blı"},null,90,{"$f":"IF(N1=90,\"Bğuć\",\"Bğuć\")","v":"Bğuć"},null,null,null,null,null,null,null,null,null,null,null,{"$f":"NJ","v":199273055133677}]
[{"$f":"MOD($A$30,100)","v":{"$error":"#NUM!"}},null,null,{"$f":"A28-3","v":4},null,null,null,null,null,null,null,null,null,null,null,null,null,{"$f":"MOD(NJ,10)","v":{"$error":"#NUM!"}}]
[{"$f":"MOD($A$30,1000)","v":275},null,null,null,"H","Şe"]
[{"$f":"MOD($A$30,10000)","v":3275},null,null,null,"K","Min"]
[{"$f":"MOD($A$30,100000)","v":13275},null,null,null,"M","Milyon"]
[null,null,null,null,"ML","Milyar"]
[null,null,null,null,"MLL","Trilyon"]
[]
[{"$f":"RIGHT(NJ,2)","v":"77"},{"$f":"RIGHT(NJ,2)-RIGHT(NJ,1)","v":70}]
[{"$f":"RIGHT(NJ,1)","v":"7"}]
[{"$f":"A41-A42","v":70}]

{"sheet":"20","index":4,"n_rows":110,"n_cols":11,"rows_kept":110,"cut":false,"hidden":true,"merged":[]}
[null,{"$f":"PÇAĞE!B3:D3","v":199273055133677}]
[null,{"$f":"D9&\" \"&D14&\" \"&D19&\" \"&D24&\" \"&D28","v":" Şe Ṫoćipĺ`ıre Pş'ıqubğure  Trilyon Ṫu Şe Ṫoćişre Pş'ıquşre şı Milyar   Ṫoćiṫure Pş'ıqutfıre tfı Milyon  Şe Ṫoćıre Pş'ıquşre şı Min xı Şe Ṫoćişre Pş'ıqubĺıre blı"},null,null,{"$f":"B2","v":" Şe Ṫoćipĺ`ıre Pş'ıqubğure  Trilyon Ṫu Şe Ṫoćişre Pş'ıquşre şı Milyar   Ṫoćiṫure Pş'ıqutfıre tfı Milyon  Şe Ṫoćıre Pş'ıquşre şı Min xı Şe Ṫoćişre Pş'ıqubĺıre blı"}]
[null,{"$f":"IF(NJ<1000000000000000,B2,\"L'ıtağer 999.999.999.999.999 neh' s''ıqu h'un fay\")","v":" Şe Ṫoćipĺ`ıre Pş'ıqubğure  Trilyon Ṫu Şe Ṫoćişre Pş'ıquşre şı Milyar   Ṫoćiṫure Pş'ıqutfıre tfı Milyon  Şe Ṫoćıre Pş'ıquşre şı Min xı Şe Ṫoćişre Pş'ıqubĺıre blı"},null,null,{"$f":"B3","v":" Şe Ṫoćipĺ`ıre Pş'ıqubğure  Trilyon Ṫu Şe Ṫoćişre Pş'ıquşre şı Milyar   Ṫoćiṫure Pş'ıqutfıre tfı Milyon  Şe Ṫoćıre Pş'ıquşre şı Min xı Şe Ṫoćişre Pş'ıqubĺıre blı"}]
[null,{"$f":"IF(NJ=0,\"ziy\",B3)","v":" Şe Ṫoćipĺ`ıre Pş'ıqubğure  Trilyon Ṫu Şe Ṫoćişre Pş'ıquşre şı Milyar   Ṫoćiṫure Pş'ıqutfıre tfı Milyon  Şe Ṫoćıre Pş'ıquşre şı Min xı Şe Ṫoćişre Pş'ıqubĺıre blı"},null,null," Şe Ṫoćipĺ`ıre Pş'ıqubğure  Trilyon Ṫu Şe Ṫoćişre Pş'ıquşre şı Milyar   Ṫoćiṫure Pş'ıqutfıre tfı Milyon  Şe Ṫoćıre Pş'ıquşre şı Min xı Şe Ṫoćişre Pş'ıqubĺıre blı"]
[{"$f":"(MOD(NJ,10^115)-MOD(NJ,10^14))/10^14","v":1},{"$f":"IF(A5=1,\"\",VLOOKUP(A5,$E$6:$F$109,2))","v":""},{"$f":"IF(B5=0,\"\",B5)","v":""}]
[{"$f":"IF(A5=0,\"\",H)","v":"Şe"},null,{"$f":"A6","v":"Şe"},null,0,0,null,0]
[{"$f":"(MOD(NJ,10^14)-MOD(NJ,10^13))/10^12","v":90},{"$f":"VLOOKUP(IF(OR(A7=10,A7=30,A7=50,A7=70,A7=90),(A7+A8),A7),$E$6:$F$109,2)","v":"Ṫoćipĺ`ıre Pş'ıqubğure"},{"$f":"IF(B7=0,\"\",B7)","v":"Ṫoćipĺ`ıre Pş'ıqubğure"},null,1,"zı",null,"zı"]
[{"$f":"(MOD(NJ,10^13)-MOD(NJ,10^12))/10^12","v":9},{"$f":"VLOOKUP(A8,$E$6:$F$109,2)","v":"bğu"},{"$f":"IF(OR(A7=10,A7=30,A7=50,A7=70,A7=90),\"\",IF(B8=0,\"\",B8))","v":""},null,2,"Ṫu",null,"Ṫu"]
[{"$f":"IF(AND(A5=\"\",A7=\"\",A8=\"\"),\"\",IF(AND(A5=0,A7=0,A8=0),\"\",MLL))","v":"Trilyon"},null,{"$f":"IF(NJ<999999999,\"\",A9)","v":"Trilyon"},{"$f":"C5&\" \"&C6&\" \"&C7&\" \"&C8&\" \"&C9","v":" Şe Ṫoćipĺ`ıre Pş'ıqubğure  Trilyon"},3,"şı",null,"şı"]
[{"$f":"(MOD(NJ,10^12)-MOD(NJ,10^11))/10^11","v":2},{"$f":"IF(A10=1,\"\",VLOOKUP(A10,$E$6:$F$109,2))","v":"Ṫu"},{"$f":"IF(B10=0,\"\",B10)","v":"Ṫu"},null,4,"pĺ`ı",null,"pĺ`ı"]
[{"$f":"IF(A10=0,\"\",H)","v":"Şe"},null,{"$f":"A11","v":"Şe"},null,5,"tfı",null,"tfı"]
[{"$f":"(MOD(NJ,10^11)-MOD(NJ,10^10))/10^9","v":70},{"$f":"VLOOKUP(IF(OR(A12=30,A12=50,A12=70,A12=90),(A12+A13),A12),$E$6:$F$109,2)","v":"Ṫoćişre Pş'ıquşre"},{"$f":"IF(B12=0,\"\",B12)","v":"Ṫoćişre Pş'ıquşre"},null,6,"xı",null,"xı"]
[{"$f":"(MOD(NJ,10^10)-MOD(NJ,10^9))/10^9","v":3},{"$f":"VLOOKUP(A13,$E$6:$F$109,2)","v":"şı"},{"$f":"IF(B13=0,\"\",B13)","v":"şı"},null,7,"blı",null,"blı"]
[{"$f":"IF(AND(A10=\"\",A12=\"\",A13=\"\"),\"\",IF(AND(A10=0,A12=0,A13=0),\"\",ML))","v":"Milyar"},null,{"$f":"IF(NJ<999999999,\"\",A14)","v":"Milyar"},{"$f":"C10&\" \"&C11&\" \"&C12&\" \"&C13&\" \"&C14","v":"Ṫu Şe Ṫoćişre Pş'ıquşre şı Milyar"},8,"yi",null,"yi"]
[{"$f":"(MOD(NJ,10^9)-MOD(NJ,10^8))/10^8","v":0},{"$f":"IF(A15=1,\"\",VLOOKUP(A15,$E$6:$F$109,2))","v":0},{"$f":"IF(B15=0,\"\",B15)","v":""},null,9,"bğu",null,"bğu"]
[{"$f":"IF(A15=0,\"\",H)","v":""},null,{"$f":"A16","v":""},null,10,"Pş'ı",null,"Pş'ı"]
[{"$f":"(MOD(NJ,10^8)-MOD(NJ,10^7))/10^6","v":50},{"$f":"VLOOKUP(IF(OR(A17=30,A17=50,A17=70,A17=90),(A17+A18),A17),$E$6:$F$109,2)","v":"Ṫoćiṫure Pş'ıqutfıre"},{"$f":"IF(B17=0,\"\",B17)","v":"Ṫoćiṫure Pş'ıqutfıre"},null,11,"Pş'ıqu`ız",null,"Pş'ıqu`ız"]
[{"$f":"(MOD(NJ,10^7)-MOD(NJ,10^6))/10^6","v":5},{"$f":"VLOOKUP(A18,$E$6:$F$109,2)","v":"tfı"},{"$f":"IF(B18=0,\"\",B18)","v":"tfı"},null,12,"Pş'ıquṫu",null,"Pş'ıquṫu"]
[{"$f":"IF(AND(A15=\"\",A17=\"\",A18=\"\"),\"\",IF(AND(A15=0,A17=0,A18=0),\"\",M))","v":"Milyon"},null,{"$f":"IF(NJ<999999,\"\",A19)","v":"Milyon"},{"$f":"C15&\" \"&C16&\" \"&C17&\" \"&C18&\" \"&C19","v":"  Ṫoćiṫure Pş'ıqutfıre tfı Milyon"},13,"Pş'ıquş",null,"Pş'ıquş"]
[{"$f":"(MOD(NJ,10^6)-MOD(NJ,10^5))/10^5","v":1},{"$f":"IF(A20=1,\"\",VLOOKUP(A20,$E$6:$F$109,2))","v":""},{"$f":"IF(B20=0,\"\",B20)","v":""},null,14,"Pş'ıqupĺ`ı",null,"Pş'ıqupĺ`ı"]
[{"$f":"IF(A20=0,\"\",H)","v":"Şe"},null,{"$f":"A21","v":"Şe"},null,15,"Pş'ıqutfı",null,"Pş'ıqutfı"]
[{"$f":"(MOD(NJ,10^5)-MOD(NJ,10^4))/10^3","v":30},{"$f":"VLOOKUP(IF(OR(A22=30,A22=50,A22=70,A22=90),(A22+A23),A22),$E$6:$F$109,2)","v":"Ṫoćıre Pş'ıquşre"},{"$f":"IF(B22=0,\"\",B22)","v":"Ṫoćıre Pş'ıquşre"},null,16,"Pş'ıquxı",null,"Pş'ıquxı"]
[{"$f":"(MOD(NJ,10^4)-MOD(NJ,10^3))/10^3","v":3},{"$f":"IF(NJ>1999,VLOOKUP(A23,$E$6:$F$109,2),\"\")","v":"şı"},{"$f":"IF(B23=0,\"\",B23)","v":"şı"},null,17,"Pş'ıqubl",null,"Pş'ıqubl"]
[{"$f":"IF(AND(A20=\"\",A22=\"\",A23=\"\"),\"\",IF(AND(A20=0,A22=0,A23=0),\"\",K))","v":"Min"},null,{"$f":"IF(NJ<999,\"\",A24)","v":"Min"},{"$f":"C20&\" \"&C21&\" \"&C22&\" \"&C23&\" \"&C24","v":" Şe Ṫoćıre Pş'ıquşre şı Min"},18,"Pş'ıquyi",null,"Pş'ıquyi"]
[{"$f":"(RIGHT(NJ,3)-RIGHT(NJ,2))/100","v":6},{"$f":"IF(A25=1,\"\",(VLOOKUP(A25,$E$6:$F$109,2)))","v":"xı"},{"$f":"IF(B25=0,\"\",B25)","v":"xı"},null,19,"Pş'ıqubğu",null,"Pş'ıqubğu"]
[{"$f":"IF(A25=0,\"\",H)","v":"Şe"},null,{"$f":"A26","v":"Şe"},null,20,"Ṫoć",{"$f":"IF(OR(#REF!=0,#REF!=\"\"),\"\",#REF!)","v":{"$error":"#REF!"}},"Ṫoć"]
[{"$f":"RIGHT(NJ,2)-RIGHT(NJ,1)","v":70},{"$f":"VLOOKUP(IF(OR(A27=30,A27=50,A27=70,A27=90),(A27+A28),A27),$E$6:$F$109,2)","v":"Ṫoćişre Pş'ıqubĺıre"},{"$f":"IF(B27=0,\"\",B27)","v":"Ṫoćişre Pş'ıqubĺıre"},null,21,"Ṫoćre Zıre",null,"Ṫoćre Zıre"]
[{"$f":"RIGHT(NJ,1)*1","v":7},{"$f":"VLOOKUP(A28,$E$6:$F$109,2)","v":"blı"},{"$f":"IF(B28=0,\"\",B28)","v":"blı"},{"$f":"C25&\" \"&C26&\" \"&C27&\" \"&C28","v":"xı Şe Ṫoćişre Pş'ıqubĺıre blı"},22,"Ṫoćre Ṫure",null,"Ṫoćre Ṫure"]
[null,null,null,null,23,"Ṫoćıre Şıre",null,"Ṫoćıre Şıre"]
[146198145613275,{"$f":"VLOOKUP(A28,$E$7:$F$110,2)","v":"blı"},null,null,24,"Ṫoćıre Pĺ`ıre",null,"Ṫoćıre Pĺ`ıre"]
[{"$f":"MOD(A30,100)-MOD(A30,10)","v":{"$error":"#NUM!"}},{"$f":"IF(A25=1,\"\",(VLOOKUP(A25,$E$6:$F$109,2)))","v":"xı"},null,{"$f":"IF(ROUND(MOD(MOD(NJ,10),1),2)>0.2,VLOOKUP(ROUND(MOD(MOD(NJ,10),0.1),2)*100,TJ,2),\"\")","v":{"$error":"#NUM!"}},25,"Ṫoćıre Tfıre",null,"Ṫoćıre Tfıre"]
[null,null,null,{"$f":"IF(MOD(MOD(NJ,10),1)>0,SJ,\"\")&IF(ROUND(MOD(MOD(NJ,10),1),2)>0.01,\"s\",\"\")","v":{"$error":"#NUM!"}},26,"Ṫoćıre Xıre",null,"Ṫoćıre Xıre"]
[{"$f":"MOD(A30,10)","v":{"$error":"#NUM!"}},{"$f":"A28*1","v":7},{"$f":"VLOOKUP(B33,$E$6:$F$109,2)","v":"blı"},null,27,"Ṫoćıre Blıre",null,"Ṫoćıre Blıre",null,null,{"$f":"NJ","v":199273055133677}]
[{"$f":"MOD($A$30,100)","v":{"$error":"#NUM!"}},null,null,{"$f":"A28-3","v":4},28,"Ṫoćıre Yire",null,"Ṫoćıre Yire",null,null,{"$f":"MOD(NJ,10)","v":{"$error":"#NUM!"}}]
[{"$f":"MOD($A$30,1000)","v":275},null,null,null,29,"Ṫoćıre Bğure",null,"Ṫoćıre Bğure"]
[{"$f":"MOD($A$30,10000)","v":3275},null,null,null,30,"Ṫoćıre Pş'ıre",null,"Ṫoćıre Pş'ıre"]
[{"$f":"MOD($A$30,100000)","v":13275},null,null,null,31,"Ṫoćıre Pş'ıquzıre",null,"Ṫoćıre Pş'ıquzıre"]
[null,null,null,null,32,"Ṫoćıre Pş'ıquṫure",null,"Ṫoćıre Pş'ıquṫure"]
[null,null,null,null,33,"Ṫoćıre Pş'ıquşre",null,"Ṫoćıre Pş'ıquşre"]
[null,null,null,null,34,"Ṫoćıre Pş'ıqupĺ`ıre",null,"Ṫoćıre Pş'ıqupĺ`ıre"]
[{"$f":"RIGHT(NJ,2)","v":"77"},{"$f":"RIGHT(NJ,2)-RIGHT(NJ,1)","v":70},null,null,35,"Ṫoćıre Pş'ıqutfıre",null,"Ṫoćıre Pş'ıqutfıre"]
[{"$f":"RIGHT(NJ,1)","v":"7"},null,null,null,36,"Ṫoćıre Pş'ıquxıre",null,"Ṫoćıre Pş'ıquxıre"]
[{"$f":"A41-A42","v":70},null,null,null,37,"Ṫoćıre Pş'ıqublıre",null,"Ṫoćıre Pş'ıqublıre"]
[null,null,null,null,38,"Ṫoćıre Pş'ıquyire",null,"Ṫoćıre Pş'ıquyire"]
[null,null,null,null,39,"Ṫoćıre Pş'ıqubğure",null,"Ṫoćıre Pş'ıqubğure"]
[null,null,null,null,40,"Ṫoćiṫu",null,"Ṫoćiṫu"]
[null,null,null,null,41,"Ṫoćiṫure Zıre",null,"Ṫoćiṫure Zıre"]
[null,null,null,null,42,"Ṫoćiṫure Ṫure",null,"Ṫoćiṫure Ṫure"]
[null,null,null,null,43,"Ṫoćiṫure Şıre",null,"Ṫoćiṫure Şıre"]
[null,null,null,null,44,"Ṫoćiṫure Pĺ`ıre",null,"Ṫoćiṫure Pĺ`ıre"]
[null,null,null,null,45,"Ṫoćiṫure Tfıre",null,"Ṫoćiṫure Tfıre"]
[null,null,null,null,46,"Ṫoćiṫure Xıre",null,"Ṫoćiṫure Xıre"]
[null,null,null,null,47,"Ṫoćiṫure Blıre",null,"Ṫoćiṫure Blıre"]
[null,null,null,null,48,"Ṫoćiṫure Yire",null,"Ṫoćiṫure Yire"]
[null,null,null,null,49,"Ṫoćiṫure Bğure",null,"Ṫoćiṫure Bğure"]
[null,null,null,null,50,"Ṫoćiṫure Pş'ıre",null,"Ṫoćiṫure Pş'ıre"]
[null,null,null,null,51,"Ṫoćiṫure Pş'ıquzıre",null,"Ṫoćiṫure Pş'ıquzıre"]
[null,null,null,null,52,"Ṫoćiṫure Pş'ıquṫure",null,"Ṫoćiṫure Pş'ıquṫure"]
[null,null,null,null,53,"Ṫoćiṫure Pş'ıquşre",null,"Ṫoćiṫure Pş'ıquşre"]
[null,null,null,null,54,"Ṫoćiṫure Pş'ıqupĺ`ıre",null,"Ṫoćiṫure Pş'ıqupĺ`ıre"]
[null,null,null,null,55,"Ṫoćiṫure Pş'ıqutfıre",null,"Ṫoćiṫure Pş'ıqutfıre"]
[null,null,null,null,56,"Ṫoćiṫure Pş'ıquxıre",null,"Ṫoćiṫure Pş'ıquxıre"]
[null,null,null,null,57,"Ṫoćiṫure Pş'ıqublıre",null,"Ṫoćiṫure Pş'ıqublıre"]
[null,null,null,null,58,"Ṫoćiṫure Pş'ıquyire",null,"Ṫoćiṫure Pş'ıquyire"]
[null,null,null,null,59,"Ṫoćiṫure Pş'ıqubğure",null,"Ṫoćiṫure Pş'ıqubğure"]
[null,null,null,null,60,"Ṫoćiş",null,"Ṫoćiş"]
[null,null,null,null,61,"Ṫoćişre Zıre",null,"Ṫoćişre Zıre"]
[null,null,null,null,62,"Ṫoćişre Ṫure",null,"Ṫoćişre Ṫure"]
[null,null,null,null,63,"Ṫoćişre Şıre",null,"Ṫoćişre Şıre"]
[null,null,null,null,64,"Ṫoćişre Pĺ`ıre",null,"Ṫoćişre Pĺ`ıre"]
[null,null,null,null,65,"Ṫoćişre Tfıre",null,"Ṫoćişre Tfıre"]
[null,null,null,null,66,"Ṫoćişre Xıre",null,"Ṫoćişre Xıre"]
[null,null,null,null,67,"Ṫoćişre Blıre",null,"Ṫoćişre Blıre"]
[null,null,null,null,68,"Ṫoćişre Yire",null,"Ṫoćişre Yire"]
[null,null,null,null,69,"Ṫoćişre Bğure",null,"Ṫoćişre Bğure"]
[null,null,null,null,70,"Ṫoćişre Pş'ıre",null,"Ṫoćişre Pş'ıre"]
[null,null,null,null,71,"Ṫoćişre Pş'ıquzıre",null,"Ṫoćişre Pş'ıquzıre"]
[null,null,null,null,72,"Ṫoćişre Pş'ıquṫure",null,"Ṫoćişre Pş'ıquṫure"]
[null,null,null,null,73,"Ṫoćişre Pş'ıquşre",null,"Ṫoćişre Pş'ıquşre"]
[null,null,null,null,74,"Ṫoćişre Pş'ıqupĺ`ıre",null,"Ṫoćişre Pş'ıqupĺ`ıre"]
[null,null,null,null,75,"Ṫoćişre Pş'ıqutfıre",null,"Ṫoćişre Pş'ıqutfıre"]
[null,null,null,null,76,"Ṫoćişre Pş'ıquxıre",null,"Ṫoćişre Pş'ıquxıre"]
[null,null,null,null,77,"Ṫoćişre Pş'ıqubĺıre",null,"Ṫoćişre Pş'ıqubĺıre"]
[null,null,null,null,78,"Ṫoćişre Pş'ıquyire",null,"Ṫoćişre Pş'ıquyire"]
[null,null,null,null,79,"Ṫoćişre Pş'ıqubğure",null,"Ṫoćişre Pş'ıqubğure"]
[null,null,null,null,80,"Ṫoćipĺ`ı",null,"Ṫoćipĺ`ı"]
[null,null,null,null,81,"Ṫoćipĺ`ıre Zıre",null,"Ṫoćipĺ`ıre Zıre"]
[null,null,null,null,82,"Ṫoćipĺ`ıre Ṫure",null,"Ṫoćipĺ`ıre Ṫure"]
[null,null,null,null,83,"Ṫoćipĺ`ıre Şıre",null,"Ṫoćipĺ`ıre Şıre"]
[null,null,null,null,84,"Ṫoćipĺ`ıre Pĺ`ıre",null,"Ṫoćipĺ`ıre Pĺ`ıre"]
[null,null,null,null,85,"Ṫoćipĺ`ıre Tfıre",null,"Ṫoćipĺ`ıre Tfıre"]
[null,null,null,null,86,"Ṫoćipĺ`ıre Xıre",null,"Ṫoćipĺ`ıre Xıre"]
[null,null,null,null,87,"Ṫoćipĺ`ıre Blıre",null,"Ṫoćipĺ`ıre Blıre"]
[null,null,null,null,88,"Ṫoćipĺ`ıre Yire",null,"Ṫoćipĺ`ıre Yire"]
[null,null,null,null,89,"Ṫoćipĺ`ıre Bğure",null,"Ṫoćipĺ`ıre Bğure"]
[null,null,null,null,90,"Ṫoćipĺ`ıre Pş'ıre",null,"Ṫoćipĺ`ıre Pş'ıre"]
[null,null,null,null,91,"Ṫoćipĺ`ıre Pş'ıquzıre",null,"Ṫoćipĺ`ıre Pş'ıquzıre"]
[null,null,null,null,92,"Ṫoćipĺ`ıre Pş'ıquṫure",null,"Ṫoćipĺ`ıre Pş'ıquṫure"]
[null,null,null,null,93,"Ṫoćipĺ`ıre Pş'ıquşre",null,"Ṫoćipĺ`ıre Pş'ıquşre"]
[null,null,null,null,94,"Ṫoćipĺ`ıre Pş'ıqupĺ`ıre",null,"Ṫoćipĺ`ıre Pş'ıqupĺ`ıre"]
[null,null,null,null,95,"Ṫoćipĺ`ıre Pş'ıqutfıre",null,"Ṫoćipĺ`ıre Pş'ıqutfıre"]
[null,null,null,null,96,"Ṫoćipĺ`ıre Pş'ıquxıre",null,"Ṫoćipĺ`ıre Pş'ıquxıre"]
[null,null,null,null,97,"Ṫoćipĺ`ıre Pş'ıqublıre",null,"Ṫoćipĺ`ıre Pş'ıqublıre"]
[null,null,null,null,98,"Ṫoćipĺ`ıre Pş'ıquyire",null,"Ṫoćipĺ`ıre Pş'ıquyire"]
[null,null,null,null,99,"Ṫoćipĺ`ıre Pş'ıqubğure",null,"Ṫoćipĺ`ıre Pş'ıqubğure"]
[null,null,null,null,"H","Şe",null,"Şe"]
[null,null,null,null,"K","Min",null,"Min"]
[null,null,null,null,"M","Milyon",null,"Melwan"]
[null,null,null,null,"ML","Milyar",null,"Milyar"]
[null,null,null,null,"MLL","Trilyon",null,"Trimelvan"]

{"sheet":"20 ĺapsew (ORJ)","index":5,"n_rows":43,"n_cols":14,"rows_kept":43,"cut":false,"hidden":true,"merged":[]}
[null,{"$f":"PÇAĞE!B3:D3","v":199273055133677}]
[null,{"$f":"D9&\" \"&D14&\" \"&D19&\" \"&D24&\" \"&D28","v":" Şe Ṫoćipĺ`ıre Pş'ıre Bğu Trilyon Ṫu Şe Ṫoćişre Pş'ıre Şı Milyar   Ṫoćiṫure Pş'ıre Tfı Milyon  Şe Ṫoćıre Pş'ıre Şı Min Xı Şe Ṫoćişre Pş'ıre Blı"},null,null,{"$f":"B2","v":" Şe Ṫoćipĺ`ıre Pş'ıre Bğu Trilyon Ṫu Şe Ṫoćişre Pş'ıre Şı Milyar   Ṫoćiṫure Pş'ıre Tfı Milyon  Şe Ṫoćıre Pş'ıre Şı Min Xı Şe Ṫoćişre Pş'ıre Blı"}]
[null,{"$f":"IF(NJ<1000000000000000,B2,\"L'ıtağer 999.999.999.999.999 neh' s''ıqu h'un fay\")","v":" Şe Ṫoćipĺ`ıre Pş'ıre Bğu Trilyon Ṫu Şe Ṫoćişre Pş'ıre Şı Milyar   Ṫoćiṫure Pş'ıre Tfı Milyon  Şe Ṫoćıre Pş'ıre Şı Min Xı Şe Ṫoćişre Pş'ıre Blı"},null,null,{"$f":"B3","v":" Şe Ṫoćipĺ`ıre Pş'ıre Bğu Trilyon Ṫu Şe Ṫoćişre Pş'ıre Şı Milyar   Ṫoćiṫure Pş'ıre Tfı Milyon  Şe Ṫoćıre Pş'ıre Şı Min Xı Şe Ṫoćişre Pş'ıre Blı"}]
[null,{"$f":"IF(NJ=0,\"ziy\",B3)","v":" Şe Ṫoćipĺ`ıre Pş'ıre Bğu Trilyon Ṫu Şe Ṫoćişre Pş'ıre Şı Milyar   Ṫoćiṫure Pş'ıre Tfı Milyon  Şe Ṫoćıre Pş'ıre Şı Min Xı Şe Ṫoćişre Pş'ıre Blı"},null,null," Şe Ṫoćipĺ`ıre Pş'ıre Bğu Trilyon Ṫu Şe Ṫoćişre Pş'ıre Şı Milyar   Ṫoćiṫure Pş'ıre Tfı Milyon  Şe Ṫoćıre Pş'ıre Şı Min Xı Şe Ṫoćişre Pş'ıre Blı"]
[{"$f":"(MOD(NJ,10^115)-MOD(NJ,10^14))/10^14","v":1},{"$f":"IF(A5=1,\"\",VLOOKUP(A5,$E$6:$F$38,2))","v":""},{"$f":"IF(B5=0,\"\",B5)","v":""}]
[{"$f":"IF(A5=0,\"\",H)","v":"Şe"},null,{"$f":"A6","v":"Şe"},null,0,0]
[{"$f":"(MOD(NJ,10^14)-MOD(NJ,10^13))/10^12","v":90},{"$f":"VLOOKUP(A7,$E$6:$F$38,2)","v":"Ṫoćipĺ`ıre Pş'ıre"},{"$f":"IF(B7=0,\"\",B7)","v":"Ṫoćipĺ`ıre Pş'ıre"},null,1,"Zı"]
[{"$f":"(MOD(NJ,10^13)-MOD(NJ,10^12))/10^12","v":9},{"$f":"VLOOKUP(A8,$E$6:$F$38,2)","v":"Bğu"},{"$f":"IF(B8=0,\"\",B8)","v":"Bğu"},null,2,"Ṫu"]
[{"$f":"IF(AND(A5=\"\",A7=\"\",A8=\"\"),\"\",IF(AND(A5=0,A7=0,A8=0),\"\",MLL))","v":"Trilyon"},null,{"$f":"IF(NJ<999999999,\"\",A9)","v":"Trilyon"},{"$f":"C5&\" \"&C6&\" \"&C7&\" \"&C8&\" \"&C9","v":" Şe Ṫoćipĺ`ıre Pş'ıre Bğu Trilyon"},3,"Şı"]
[{"$f":"(MOD(NJ,10^12)-MOD(NJ,10^11))/10^11","v":2},{"$f":"IF(A10=1,\"\",VLOOKUP(A10,$E$6:$F$38,2))","v":"Ṫu"},{"$f":"IF(B10=0,\"\",B10)","v":"Ṫu"},null,4,"Pĺ`ı"]
[{"$f":"IF(A10=0,\"\",H)","v":"Şe"},null,{"$f":"A11","v":"Şe"},null,5,"Tfı"]
[{"$f":"(MOD(NJ,10^11)-MOD(NJ,10^10))/10^9","v":70},{"$f":"VLOOKUP(A12,$E$6:$F$38,2)","v":"Ṫoćişre Pş'ıre"},{"$f":"IF(B12=0,\"\",B12)","v":"Ṫoćişre Pş'ıre"},null,6,"Xı"]
[{"$f":"(MOD(NJ,10^10)-MOD(NJ,10^9))/10^9","v":3},{"$f":"VLOOKUP(A13,$E$6:$F$38,2)","v":"Şı"},{"$f":"IF(B13=0,\"\",B13)","v":"Şı"},null,7,"Blı"]
[{"$f":"IF(AND(A10=\"\",A12=\"\",A13=\"\"),\"\",IF(AND(A10=0,A12=0,A13=0),\"\",ML))","v":"Milyar"},null,{"$f":"IF(NJ<999999999,\"\",A14)","v":"Milyar"},{"$f":"C10&\" \"&C11&\" \"&C12&\" \"&C13&\" \"&C14","v":"Ṫu Şe Ṫoćişre Pş'ıre Şı Milyar"},8,"Yi"]
[{"$f":"(MOD(NJ,10^9)-MOD(NJ,10^8))/10^8","v":0},{"$f":"IF(A15=1,\"\",VLOOKUP(A15,$E$6:$F$38,2))","v":0},{"$f":"IF(B15=0,\"\",B15)","v":""},null,9,"Bğu"]
[{"$f":"IF(A15=0,\"\",H)","v":""},null,{"$f":"A16","v":""},null,10,"Pş'ı"]
[{"$f":"(MOD(NJ,10^8)-MOD(NJ,10^7))/10^6","v":50},{"$f":"VLOOKUP(A17,$E$6:$F$38,2)","v":"Ṫoćiṫure Pş'ıre"},{"$f":"IF(B17=0,\"\",B17)","v":"Ṫoćiṫure Pş'ıre"},null,11,"Pş'ıqu`ız"]
[{"$f":"(MOD(NJ,10^7)-MOD(NJ,10^6))/10^6","v":5},{"$f":"VLOOKUP(A18,$E$6:$F$38,2)","v":"Tfı"},"Tfı",null,12,"Pş'ıquṪu"]
[{"$f":"IF(AND(A15=\"\",A17=\"\",A18=\"\"),\"\",IF(AND(A15=0,A17=0,A18=0),\"\",M))","v":"Milyon"},null,{"$f":"IF(NJ<999999,\"\",A19)","v":"Milyon"},{"$f":"C15&\" \"&C16&\" \"&C17&\" \"&C18&\" \"&C19","v":"  Ṫoćiṫure Pş'ıre Tfı Milyon"},13,"Pş'ıquş"]
[{"$f":"(MOD(NJ,10^6)-MOD(NJ,10^5))/10^5","v":1},{"$f":"IF(A20=1,\"\",VLOOKUP(A20,$E$6:$F$38,2))","v":""},{"$f":"IF(B20=0,\"\",B20)","v":""},null,14,"Pş'ıqupĺ`ı"]
[{"$f":"IF(A20=0,\"\",H)","v":"Şe"},null,{"$f":"A21","v":"Şe"},null,15,"Pş'ıqutfı"]
[{"$f":"(MOD(NJ,10^5)-MOD(NJ,10^4))/10^3","v":30},{"$f":"VLOOKUP(A22,$E$6:$F$38,2)","v":"Ṫoćıre Pş'ıre"},{"$f":"IF(B22=0,\"\",B22)","v":"Ṫoćıre Pş'ıre"},null,16,"Pş'ıquxı"]
[{"$f":"(MOD(NJ,10^4)-MOD(NJ,10^3))/10^3","v":3},{"$f":"IF(NJ>1999,VLOOKUP(A23,$E$6:$F$38,2),\"\")","v":"Şı"},{"$f":"IF(B23=0,\"\",B23)","v":"Şı"},null,17,"Pş'ıqublı"]
[{"$f":"IF(AND(A20=\"\",A22=\"\",A23=\"\"),\"\",IF(AND(A20=0,A22=0,A23=0),\"\",K))","v":"Min"},null,{"$f":"IF(NJ<999,\"\",A24)","v":"Min"},{"$f":"C20&\" \"&C21&\" \"&C22&\" \"&C23&\" \"&C24","v":" Şe Ṫoćıre Pş'ıre Şı Min"},18,"Pş'ıquyi"]
[{"$f":"(RIGHT(NJ,3)-RIGHT(NJ,2))/100","v":6},{"$f":"IF(A25=1,\"\",(VLOOKUP(A25,$E$6:$F$38,2)))","v":"Xı"},{"$f":"IF(B25=0,\"\",B25)","v":"Xı"},null,19,"Pş'ıqubğu"]
[{"$f":"IF(A25=0,\"\",H)","v":"Şe"},null,{"$f":"A26","v":"Şe"},null,20,"Ṫoć",null,null,null,{"$f":"IF(OR(#REF!=0,#REF!=\"\"),\"\",#REF!)","v":{"$error":"#REF!"}}]
[{"$f":"RIGHT(NJ,2)-RIGHT(NJ,1)","v":70},{"$f":"VLOOKUP(A27,$E$6:$F$38,2)","v":"Ṫoćişre Pş'ıre"},{"$f":"IF(B27=0,\"\",B27)","v":"Ṫoćişre Pş'ıre"},null,30,"Ṫoćıre Pş'ıre"]
[{"$f":"RIGHT(NJ,1)*1","v":7},{"$f":"VLOOKUP(A28,$E$6:$F$38,2)","v":"Blı"},{"$f":"IF(B28=0,\"\",B28)","v":"Blı"},{"$f":"C25&\" \"&C26&\" \"&C27&\" \"&C28","v":"Xı Şe Ṫoćişre Pş'ıre Blı"},40,"Ṫoćiṫu"]
[null,null,null,null,50,"Ṫoćiṫure Pş'ıre"]
[146198145613275,{"$f":"VLOOKUP(A28,$E$7:$F$39,2)","v":"Blı"},null,null,60,"Ṫoćiş"]
[{"$f":"MOD(A30,100)-MOD(A30,10)","v":{"$error":"#NUM!"}},{"$f":"IF(A25=1,\"\",(VLOOKUP(A25,$E$6:$F$38,2)))","v":"Xı"},null,{"$f":"IF(ROUND(MOD(MOD(NJ,10),1),2)>0.2,VLOOKUP(ROUND(MOD(MOD(NJ,10),0.1),2)*100,TJ,2),\"\")","v":{"$error":"#NUM!"}},70,"Ṫoćişre Pş'ıre"]
[null,null,null,{"$f":"IF(MOD(MOD(NJ,10),1)>0,SJ,\"\")&IF(ROUND(MOD(MOD(NJ,10),1),2)>0.01,\"s\",\"\")","v":{"$error":"#NUM!"}},80,"Ṫoćipĺ`ı"]
[{"$f":"MOD(A30,10)","v":{"$error":"#NUM!"}},{"$f":"A28*1","v":7},{"$f":"VLOOKUP(B33,$E$6:$F$38,2)","v":"Blı"},null,90,"Ṫoćipĺ`ıre Pş'ıre",null,null,null,null,null,null,null,{"$f":"NJ","v":199273055133677}]
[{"$f":"MOD($A$30,100)","v":{"$error":"#NUM!"}},null,null,{"$f":"A28-3","v":4},null,null,null,null,null,null,null,null,null,{"$f":"MOD(NJ,10)","v":{"$error":"#NUM!"}}]
[{"$f":"MOD($A$30,1000)","v":275},null,null,null,"H","Şe"]
[{"$f":"MOD($A$30,10000)","v":3275},null,null,null,"K","Min"]
[{"$f":"MOD($A$30,100000)","v":13275},null,null,null,"M","Milyon"]
[null,null,null,null,"ML","Milyar"]
[null,null,null,null,"MLL","Trilyon"]
[]
[{"$f":"RIGHT(NJ,2)","v":"77"},{"$f":"RIGHT(NJ,2)-RIGHT(NJ,1)","v":70}]
[{"$f":"RIGHT(NJ,1)","v":"7"}]
[{"$f":"A41-A42","v":70}]

{"sheet":"l'ıte_2","index":6,"n_rows":43,"n_cols":18,"rows_kept":43,"cut":false,"hidden":true,"merged":[]}
[null,{"$f":"PÇAĞE!B3:D3","v":199273055133677}]
[null,{"$f":"D9&\" \"&D14&\" \"&D19&\" \"&D24&\" \"&D28","v":" Şe Bğupş`ı Bğu Trimelvan T'`u Şe Blıḉ Şı Milyar   Tfıpş`ı Tfı Melwan  Şe Şıpş`ı Şı Min Xı Şe Blıḉ Blı"}]
[null,{"$f":"IF(NJ<1000000000000000,B2,\"L'ıtağer 999.999.999.999.999 neh' s''ıqu h'un fay\")","v":" Şe Bğupş`ı Bğu Trimelvan T'`u Şe Blıḉ Şı Milyar   Tfıpş`ı Tfı Melwan  Şe Şıpş`ı Şı Min Xı Şe Blıḉ Blı"}]
[null,{"$f":"IF(NJ=0,\"ziy\",B3)","v":" Şe Bğupş`ı Bğu Trimelvan T'`u Şe Blıḉ Şı Milyar   Tfıpş`ı Tfı Melwan  Şe Şıpş`ı Şı Min Xı Şe Blıḉ Blı"}]
[{"$f":"(MOD(NJ,10^115)-MOD(NJ,10^14))/10^14","v":1},{"$f":"IF(A5=1,\"\",VLOOKUP(A5,$E$6:$F$38,2))","v":""},{"$f":"IF(B5=0,\"\",B5)","v":""}]
[{"$f":"IF(A5=0,\"\",H)","v":"Şe"},null,{"$f":"A6","v":"Şe"},null,0,0]
[{"$f":"(MOD(NJ,10^14)-MOD(NJ,10^13))/10^12","v":90},{"$f":"VLOOKUP(A7,$E$6:$F$38,2)","v":"Bğupş`ı"},{"$f":"IF(B7=0,\"\",B7)","v":"Bğupş`ı"},null,1,"Zı"]
[{"$f":"(MOD(NJ,10^13)-MOD(NJ,10^12))/10^12","v":9},{"$f":"VLOOKUP(A8,$E$6:$F$38,2)","v":"Bğu"},{"$f":"IF(B8=0,\"\",B8)","v":"Bğu"},null,2,"T'`u"]
[{"$f":"IF(AND(A5=\"\",A7=\"\",A8=\"\"),\"\",IF(AND(A5=0,A7=0,A8=0),\"\",MLL))","v":"Trimelvan"},null,{"$f":"IF(NJ<999999999,\"\",A9)","v":"Trimelvan"},{"$f":"C5&\" \"&C6&\" \"&C7&\" \"&C8&\" \"&C9","v":" Şe Bğupş`ı Bğu Trimelvan"},3,"Şı"]
[{"$f":"(MOD(NJ,10^12)-MOD(NJ,10^11))/10^11","v":2},{"$f":"IF(A10=1,\"\",VLOOKUP(A10,$E$6:$F$38,2))","v":"T'`u"},{"$f":"IF(B10=0,\"\",B10)","v":"T'`u"},null,4,"Pĺ`ı"]
[{"$f":"IF(A10=0,\"\",H)","v":"Şe"},null,{"$f":"A11","v":"Şe"},null,5,"Tfı"]
[{"$f":"(MOD(NJ,10^11)-MOD(NJ,10^10))/10^9","v":70},{"$f":"VLOOKUP(A12,$E$6:$F$38,2)","v":"Blıḉ"},{"$f":"IF(B12=0,\"\",B12)","v":"Blıḉ"},null,6,"Xı"]
[{"$f":"(MOD(NJ,10^10)-MOD(NJ,10^9))/10^9","v":3},{"$f":"VLOOKUP(A13,$E$6:$F$38,2)","v":"Şı"},{"$f":"IF(B13=0,\"\",B13)","v":"Şı"},null,7,"Blı"]
[{"$f":"IF(AND(A10=\"\",A12=\"\",A13=\"\"),\"\",IF(AND(A10=0,A12=0,A13=0),\"\",ML))","v":"Milyar"},null,{"$f":"IF(NJ<999999999,\"\",A14)","v":"Milyar"},{"$f":"C10&\" \"&C11&\" \"&C12&\" \"&C13&\" \"&C14","v":"T'`u Şe Blıḉ Şı Milyar"},8,"Yi"]
[{"$f":"(MOD(NJ,10^9)-MOD(NJ,10^8))/10^8","v":0},{"$f":"IF(A15=1,\"\",VLOOKUP(A15,$E$6:$F$38,2))","v":0},{"$f":"IF(B15=0,\"\",B15)","v":""},null,9,"Bğu"]
[{"$f":"IF(A15=0,\"\",H)","v":""},null,{"$f":"A16","v":""},null,10,"Pş`ı"]
[{"$f":"(MOD(NJ,10^8)-MOD(NJ,10^7))/10^6","v":50},{"$f":"VLOOKUP(A17,$E$6:$F$38,2)","v":"Tfıpş`ı"},{"$f":"IF(B17=0,\"\",B17)","v":"Tfıpş`ı"},null,11,"Pş`ı zı"]
[{"$f":"(MOD(NJ,10^7)-MOD(NJ,10^6))/10^6","v":5},{"$f":"VLOOKUP(A18,$E$6:$F$38,2)","v":"Tfı"},"Tfı",null,12,"Pş`ı ṫ`u"]
[{"$f":"IF(AND(A15=\"\",A17=\"\",A18=\"\"),\"\",IF(AND(A15=0,A17=0,A18=0),\"\",M))","v":"Melwan"},null,{"$f":"IF(NJ<999999,\"\",A19)","v":"Melwan"},{"$f":"C15&\" \"&C16&\" \"&C17&\" \"&C18&\" \"&C19","v":"  Tfıpş`ı Tfı Melwan"},13,"Pş`ı şı"]
[{"$f":"(MOD(NJ,10^6)-MOD(NJ,10^5))/10^5","v":1},{"$f":"IF(A20=1,\"\",VLOOKUP(A20,$E$6:$F$38,2))","v":""},{"$f":"IF(B20=0,\"\",B20)","v":""},null,14,"Pş`ı pĺ`ı"]
[{"$f":"IF(A20=0,\"\",H)","v":"Şe"},null,{"$f":"A21","v":"Şe"},null,15,"Pş`ı tfı"]
[{"$f":"(MOD(NJ,10^5)-MOD(NJ,10^4))/10^3","v":30},{"$f":"VLOOKUP(A22,$E$6:$F$38,2)","v":"Şıpş`ı"},{"$f":"IF(B22=0,\"\",B22)","v":"Şıpş`ı"},null,16,"Pş`ı xı"]
[{"$f":"(MOD(NJ,10^4)-MOD(NJ,10^3))/10^3","v":3},{"$f":"IF(NJ>1999,VLOOKUP(A23,$E$6:$F$38,2),\"\")","v":"Şı"},{"$f":"IF(B23=0,\"\",B23)","v":"Şı"},null,17,"Pş`ı blı"]
[{"$f":"IF(AND(A20=\"\",A22=\"\",A23=\"\"),\"\",IF(AND(A20=0,A22=0,A23=0),\"\",K))","v":"Min"},null,{"$f":"IF(NJ<999,\"\",A24)","v":"Min"},{"$f":"C20&\" \"&C21&\" \"&C22&\" \"&C23&\" \"&C24","v":" Şe Şıpş`ı Şı Min"},18,"Pş`ı yi"]
[{"$f":"(RIGHT(NJ,3)-RIGHT(NJ,2))/100","v":6},{"$f":"IF(A25=1,\"\",(VLOOKUP(A25,$E$6:$F$38,2)))","v":"Xı"},{"$f":"IF(B25=0,\"\",B25)","v":"Xı"},null,19,"Pş`ı bğu"]
[{"$f":"IF(A25=0,\"\",H)","v":"Şe"},null,{"$f":"A26","v":"Şe"},null,20,"Ṫ`upş`ı",null,null,null,null,null,null,null,{"$f":"IF(OR(#REF!=0,#REF!=\"\"),\"\",#REF!)","v":{"$error":"#REF!"}}]
[{"$f":"RIGHT(NJ,2)-RIGHT(NJ,1)","v":70},{"$f":"VLOOKUP(A27,$E$6:$F$38,2)","v":"Blıḉ"},{"$f":"IF(B27=0,\"\",B27)","v":"Blıḉ"},null,30,"Şıpş`ı"]
[{"$f":"RIGHT(NJ,1)*1","v":7},{"$f":"VLOOKUP(A28,$E$6:$F$38,2)","v":"Blı"},{"$f":"IF(B28=0,\"\",B28)","v":"Blı"},{"$f":"C25&\" \"&C26&\" \"&C27&\" \"&C28","v":"Xı Şe Blıḉ Blı"},40,{"$f":"IF(N1=40,\"Pıĺ`ıpş`ı'\",\"Pıĺ`ıpş`ı'\")","v":"Pıĺ`ıpş`ı'"}]
[null,null,null,null,50,{"$f":"IF(N1=50,\"Tfıpş`ı\",\"Tfıpş`ı\")","v":"Tfıpş`ı"}]
[146198145613275,{"$f":"VLOOKUP(A28,$E$7:$F$39,2)","v":"Blı"},null,null,60,{"$f":"IF(N1=60,\"Xıpş`ı\",\"Xıpş`ı\")","v":"Xıpş`ı"}]
[{"$f":"MOD(A30,100)-MOD(A30,10)","v":{"$error":"#NUM!"}},{"$f":"IF(A25=1,\"\",(VLOOKUP(A25,$E$6:$F$38,2)))","v":"Xı"},null,{"$f":"IF(ROUND(MOD(MOD(NJ,10),1),2)>0.2,VLOOKUP(ROUND(MOD(MOD(NJ,10),0.1),2)*100,TJ,2),\"\")","v":{"$error":"#NUM!"}},70,{"$f":"IF(N1=70,\"Blıḉ\",\"Blıḉ\")","v":"Blıḉ"}]
[null,null,null,{"$f":"IF(MOD(MOD(NJ,10),1)>0,SJ,\"\")&IF(ROUND(MOD(MOD(NJ,10),1),2)>0.01,\"s\",\"\")","v":{"$error":"#NUM!"}},80,{"$f":"IF(N1=80,\"Yipş`ı\",\"Yipş`ı\")","v":"Yipş`ı"}]
[{"$f":"MOD(A30,10)","v":{"$error":"#NUM!"}},{"$f":"A28*1","v":7},{"$f":"VLOOKUP(B33,$E$6:$F$38,2)","v":"Blı"},null,90,{"$f":"IF(N1=90,\"Bğupş`ı\",\"Bğupş`ı\")","v":"Bğupş`ı"},null,null,null,null,null,null,null,null,null,null,null,{"$f":"NJ","v":199273055133677}]
[{"$f":"MOD($A$30,100)","v":{"$error":"#NUM!"}},null,null,{"$f":"A28-3","v":4},null,null,null,null,null,null,null,null,null,null,null,null,null,{"$f":"MOD(NJ,10)","v":{"$error":"#NUM!"}}]
[{"$f":"MOD($A$30,1000)","v":275},null,null,null,"H","Şe"]
[{"$f":"MOD($A$30,10000)","v":3275},null,null,null,"K","Min"]
[{"$f":"MOD($A$30,100000)","v":13275},null,null,null,"M","Melwan"]
[null,null,null,null,"ML","Milyar"]
[null,null,null,null,"MLL","Trimelvan"]
[]
[{"$f":"RIGHT(NJ,2)","v":"77"},{"$f":"RIGHT(NJ,2)-RIGHT(NJ,1)","v":70}]
[{"$f":"RIGHT(NJ,1)","v":"7"}]
[{"$f":"A41-A42","v":70}]

{"sheet":"pş'ı oaćew","index":7,"n_rows":43,"n_cols":18,"rows_kept":43,"cut":false,"hidden":true,"merged":[]}
[null,{"$f":"PÇAĞE!B3:D3","v":199273055133677}]
[null,{"$f":"D9&\" \"&D14&\" \"&D19&\" \"&D24&\" \"&D28","v":" Şe Bğuć Bğu Trilyon Ṫu Şe Blıć Şı Milyar   Tfıć Tfı melwan  Şe Şeć Şı min Xı Şe Blıć Blı"}]
[null,{"$f":"IF(NJ<1000000000000000,B2,\"L'ıtağer 999.999.999.999.999 neh' s''ıqu h'un fay\")","v":" Şe Bğuć Bğu Trilyon Ṫu Şe Blıć Şı Milyar   Tfıć Tfı melwan  Şe Şeć Şı min Xı Şe Blıć Blı"}]
[null,{"$f":"IF(NJ=0,\"ziy\",B3)","v":" Şe Bğuć Bğu Trilyon Ṫu Şe Blıć Şı Milyar   Tfıć Tfı melwan  Şe Şeć Şı min Xı Şe Blıć Blı"}]
[{"$f":"(MOD(NJ,10^115)-MOD(NJ,10^14))/10^14","v":1},{"$f":"IF(A5=1,\"\",VLOOKUP(A5,$E$6:$F$38,2))","v":""},{"$f":"IF(B5=0,\"\",B5)","v":""}]
[{"$f":"IF(A5=0,\"\",pş_ı)","v":"Şe"},null,{"$f":"A6","v":"Şe"},null,0,0]
[{"$f":"(MOD(NJ,10^14)-MOD(NJ,10^13))/10^12","v":90},{"$f":"VLOOKUP(A7,$E$6:$F$38,2)","v":"Bğuć"},{"$f":"IF(B7=0,\"\",B7)","v":"Bğuć"},null,1,"Zı"]
[{"$f":"(MOD(NJ,10^13)-MOD(NJ,10^12))/10^12","v":9},{"$f":"VLOOKUP(A8,$E$6:$F$38,2)","v":"Bğu"},{"$f":"IF(B8=0,\"\",B8)","v":"Bğu"},null,2,"Ṫu"]
[{"$f":"IF(AND(A5=\"\",A7=\"\",A8=\"\"),\"\",IF(AND(A5=0,A7=0,A8=0),\"\",MLL))","v":"Trilyon"},null,{"$f":"IF(NJ<999999999,\"\",A9)","v":"Trilyon"},{"$f":"C5&\" \"&C6&\" \"&C7&\" \"&C8&\" \"&C9","v":" Şe Bğuć Bğu Trilyon"},3,"Şı"]
[{"$f":"(MOD(NJ,10^12)-MOD(NJ,10^11))/10^11","v":2},{"$f":"IF(A10=1,\"\",VLOOKUP(A10,$E$6:$F$38,2))","v":"Ṫu"},{"$f":"IF(B10=0,\"\",B10)","v":"Ṫu"},null,4,"Pĺ`ı"]
[{"$f":"IF(A10=0,\"\",pş_ı)","v":"Şe"},null,{"$f":"A11","v":"Şe"},null,5,"Tfı"]
[{"$f":"(MOD(NJ,10^11)-MOD(NJ,10^10))/10^9","v":70},{"$f":"VLOOKUP(A12,$E$6:$F$38,2)","v":"Blıć"},{"$f":"IF(B12=0,\"\",B12)","v":"Blıć"},null,6,"Xı"]
[{"$f":"(MOD(NJ,10^10)-MOD(NJ,10^9))/10^9","v":3},{"$f":"VLOOKUP(A13,$E$6:$F$38,2)","v":"Şı"},{"$f":"IF(B13=0,\"\",B13)","v":"Şı"},null,7,"Blı"]
[{"$f":"IF(AND(A10=\"\",A12=\"\",A13=\"\"),\"\",IF(AND(A10=0,A12=0,A13=0),\"\",ML))","v":"Milyar"},null,{"$f":"IF(NJ<999999999,\"\",A14)","v":"Milyar"},{"$f":"C10&\" \"&C11&\" \"&C12&\" \"&C13&\" \"&C14","v":"Ṫu Şe Blıć Şı Milyar"},8,"Yi"]
[{"$f":"(MOD(NJ,10^9)-MOD(NJ,10^8))/10^8","v":0},{"$f":"IF(A15=1,\"\",VLOOKUP(A15,$E$6:$F$38,2))","v":0},{"$f":"IF(B15=0,\"\",B15)","v":""},null,9,"Bğu"]
[{"$f":"IF(A15=0,\"\",pş_ı)","v":""},null,{"$f":"A16","v":""},null,10,"Pş`ı"]
[{"$f":"(MOD(NJ,10^8)-MOD(NJ,10^7))/10^6","v":50},{"$f":"VLOOKUP(A17,$E$6:$F$38,2)","v":"Tfıć"},{"$f":"IF(B17=0,\"\",B17)","v":"Tfıć"},null,11,"Pş`ı zı"]
[{"$f":"(MOD(NJ,10^7)-MOD(NJ,10^6))/10^6","v":5},{"$f":"VLOOKUP(A18,$E$6:$F$38,2)","v":"Tfı"},"Tfı",null,12,"Pş`ı ṫ`u"]
[{"$f":"IF(AND(A15=\"\",A17=\"\",A18=\"\"),\"\",IF(AND(A15=0,A17=0,A18=0),\"\",M))","v":"melwan"},null,{"$f":"IF(NJ<999999,\"\",A19)","v":"melwan"},{"$f":"C15&\" \"&C16&\" \"&C17&\" \"&C18&\" \"&C19","v":"  Tfıć Tfı melwan"},13,"Pş`ı şı"]
[{"$f":"(MOD(NJ,10^6)-MOD(NJ,10^5))/10^5","v":1},{"$f":"IF(A20=1,\"\",VLOOKUP(A20,$E$6:$F$38,2))","v":""},{"$f":"IF(B20=0,\"\",B20)","v":""},null,14,"Pş`ı pĺ`ı"]
[{"$f":"IF(A20=0,\"\",pş_ı)","v":"Şe"},null,{"$f":"A21","v":"Şe"},null,15,"Pş`ı tfı"]
[{"$f":"(MOD(NJ,10^5)-MOD(NJ,10^4))/10^3","v":30},{"$f":"VLOOKUP(A22,$E$6:$F$38,2)","v":"Şeć"},{"$f":"IF(B22=0,\"\",B22)","v":"Şeć"},null,16,"Pş`ı xı"]
[{"$f":"(MOD(NJ,10^4)-MOD(NJ,10^3))/10^3","v":3},{"$f":"IF(NJ>1999,VLOOKUP(A23,$E$6:$F$38,2),\"\")","v":"Şı"},{"$f":"IF(B23=0,\"\",B23)","v":"Şı"},null,17,"Pş`ı blı"]
[{"$f":"IF(AND(A20=\"\",A22=\"\",A23=\"\"),\"\",IF(AND(A20=0,A22=0,A23=0),\"\",K))","v":"min"},null,{"$f":"IF(NJ<999,\"\",A24)","v":"min"},{"$f":"C20&\" \"&C21&\" \"&C22&\" \"&C23&\" \"&C24","v":" Şe Şeć Şı min"},18,"Pş`ı yi"]
[{"$f":"(RIGHT(NJ,3)-RIGHT(NJ,2))/100","v":6},{"$f":"IF(A25=1,\"\",(VLOOKUP(A25,$E$6:$F$38,2)))","v":"Xı"},{"$f":"IF(B25=0,\"\",B25)","v":"Xı"},null,19,"Pş`ı bğu"]
[{"$f":"IF(A25=0,\"\",pş_ı)","v":"Şe"},null,{"$f":"A26","v":"Şe"},null,20,"Ṫ`oć",null,null,null,null,null,null,null,{"$f":"IF(OR(#REF!=0,#REF!=\"\"),\"\",#REF!)","v":{"$error":"#REF!"}}]
[{"$f":"RIGHT(NJ,2)-RIGHT(NJ,1)","v":70},{"$f":"VLOOKUP(A27,$E$6:$F$38,2)","v":"Blıć"},{"$f":"IF(B27=0,\"\",B27)","v":"Blıć"},null,30,"Şeć"]
[{"$f":"RIGHT(NJ,1)*1","v":7},{"$f":"VLOOKUP(A28,$E$6:$F$38,2)","v":"Blı"},{"$f":"IF(B28=0,\"\",B28)","v":"Blı"},{"$f":"C25&\" \"&C26&\" \"&C27&\" \"&C28","v":"Xı Şe Blıć Blı"},40,{"$f":"IF(N1=40,\"Pıĺ`ć\",\"Pĺ`ıć\")","v":"Pĺ`ıć"}]
[null,null,null,null,50,{"$f":"IF(N1=50,\"Tfıć\",\"Tfıć\")","v":"Tfıć"}]
[146198145613275,{"$f":"VLOOKUP(A28,$E$7:$F$39,2)","v":"Blı"},null,null,60,{"$f":"IF(N1=60,\"Xıć\",\"Xıć\")","v":"Xıć"}]
[{"$f":"MOD(A30,100)-MOD(A30,10)","v":{"$error":"#NUM!"}},{"$f":"IF(A25=1,\"\",(VLOOKUP(A25,$E$6:$F$38,2)))","v":"Xı"},null,{"$f":"IF(ROUND(MOD(MOD(NJ,10),1),2)>0.2,VLOOKUP(ROUND(MOD(MOD(NJ,10),0.1),2)*100,TJ,2),\"\")","v":{"$error":"#NUM!"}},70,{"$f":"IF(N1=70,\"Blıć\",\"Blıć\")","v":"Blıć"}]
[null,null,null,{"$f":"IF(MOD(MOD(NJ,10),1)>0,SJ,\"\")&IF(ROUND(MOD(MOD(NJ,10),1),2)>0.01,\"s\",\"\")","v":{"$error":"#NUM!"}},80,{"$f":"IF(N1=80,\"Yić\",\"Yić\")","v":"Yić"}]
[{"$f":"MOD(A30,10)","v":{"$error":"#NUM!"}},{"$f":"A28*1","v":7},{"$f":"VLOOKUP(B33,$E$6:$F$38,2)","v":"Blı"},null,90,{"$f":"IF(N1=90,\"Bğuć\",\"Bğuć\")","v":"Bğuć"},null,null,null,null,null,null,null,null,null,null,null,{"$f":"NJ","v":199273055133677}]
[{"$f":"MOD($A$30,100)","v":{"$error":"#NUM!"}},null,null,{"$f":"A28-3","v":4},null,null,null,null,null,null,null,null,null,null,null,null,null,{"$f":"MOD(NJ,10)","v":{"$error":"#NUM!"}}]
[{"$f":"MOD($A$30,1000)","v":275},null,null,null,"H","Şe"]
[{"$f":"MOD($A$30,10000)","v":3275},null,null,null,"K","Min"]
[{"$f":"MOD($A$30,100000)","v":13275},null,null,null,"M","Melwan"]
[null,null,null,null,"ML","Milyar"]
[null,null,null,null,"MLL","Trimelvan"]
[]
[{"$f":"RIGHT(NJ,2)","v":"77"},{"$f":"RIGHT(NJ,2)-RIGHT(NJ,1)","v":70}]
[{"$f":"RIGHT(NJ,1)","v":"7"}]
[{"$f":"A41-A42","v":70}]

{"sheet":"A_NEW","index":8,"n_rows":45,"n_cols":20,"rows_kept":45,"cut":false,"hidden":true,"merged":[[1,2,1,6],[2,2,2,6],[3,2,3,6],[4,2,4,6]]}
[]
[null,null,{"$f":"PÇAĞE!B3","v":199273055133677}]
[null,null,{"$f":"IF(AND(N<200,N>100),F24&\" \"&K25&\" \"&E25&\" \"&E26,E13&\" \"&E14&\" \"&E15&\" \"&E16&\" \"&E17&\" \"&E18&\" \"&E19&\" \"&E20&\" \"&E21&\" \"&E22&\" \"&E23&\" \"&E24&\" \"&E25&\" \"&E26)","v":{"$error":"#NUM!"}}]
[null,null,{"$f":"IF(#REF!=\"www.danef.com\",IF(#REF!<1000000000000,A_NEW!C3,\"Pçağer zımilyarım neh' ts'qu h'unfay !\"),\"danef.com\")","v":{"$error":"#REF!"}}]
[null,null,{"$f":"IF(N=0,\"ziy\",C4)","v":{"$error":"#REF!"}}]
[]
[null,null,null,"d7",{"$f":"IF(F7=\"zı\",\"\",IF(F7=0,\"\",F7))","v":"bğuç'"},{"$f":"VLOOKUP(N/10^10,T,2)","v":"bğuç'"}]
[null,null,null,"d8",{"$f":"IF(F8=0,\"\",F8)","v":"şe"},{"$f":"IF(N>=10^10,H,\"\")","v":"şe"}]
[null,null,null,"d9",{"$f":"IF(F9=\"zı\",\"\",IF(F9=0,\"\",F9))","v":"bğuç'"},{"$f":"VLOOKUP(MOD(N,10^12)/10^9,T,2)","v":"bğuç'"}]
[null,null,null,"d10",{"$f":"IF(OR(F10=0,F10=\"\"),\"\",F10)","v":"tfı"},{"$f":"IF(MOD(N,10^8)>=2*10^7,VLOOKUP(MOD(N,10^7)/10^6,T,2),\"\")","v":"tfı"}]
[null,null,null,"d11",{"$f":"IF(F11=0,\"\",F11)","v":{"$error":"#NAME?"}},{"$f":"IF(N/10^9>=1,MIL,\"\")","v":{"$error":"#NAME?"}}]
[null,null,null,"d12",{"$f":"IF(F12=\"zı\",\"\",IF(F12=0,\"\",F12))","v":"şı"},{"$f":"VLOOKUP(MOD(N,10^10)/10^9,T,2)","v":"şı"}]
[null,0,null,"d13",{"$f":"IF(F13=\"zı\",\"\",IF(F13=0,\"\",F13))","v":"bğuç'"},{"$f":"VLOOKUP(N/10^8,T,2)","v":"bğuç'"}]
["zı",1,"zı","d14",{"$f":"IF(F14=0,\"\",F14)","v":"şe"},{"$f":"IF(N>=10^8,H,\"\")","v":"şe"}]
["t'`u",2,"t'`u","d15",{"$f":"IF(F15=\"zı\",\"\",IF(F15=0,\"\",F15))","v":"tfıç'"},{"$f":"VLOOKUP(MOD(N,10^8)/10^6,T,2)","v":"tfıç'"},null,null,"d9",null,{"$f":"IF(MOD(N,10^8)>=10^6,\"and \",\"\")","v":"and "}]
["şı",3,"şı","d16",{"$f":"IF(OR(F16=0,F16=\"\"),\"\",F16)","v":"tfı"},{"$f":"IF(MOD(N,10^8)>=2*10^7,VLOOKUP(MOD(N,10^7)/10^6,T,2),\"\")","v":"tfı"}]
["pl'`ı",4,"pl'`ı","d17",{"$f":"IF(F17=0,\"\",F17)","v":"melwan"},{"$f":"IF(N/10^6>=1,M,\"\")","v":"melwan"}]
["tfı",5,"tfı","d18",{"$f":"IF(F18=\"zı\",\"\",IF(F18=0,\"\",F18))","v":""},{"$f":"VLOOKUP(MOD(N,10^6)/10^5,T,2)","v":"zı"}]
["xı",6,"xı","d19",{"$f":"IF(F19=0,\"\",F19)","v":"şe"},{"$f":"IF(MOD(N,10^6)>=10^5,H,\"\")","v":"şe"}]
["blı",7,"blı","d20",{"$f":"IF(F20=\"zı\",\"\",IF(F20=0,\"\",F20))","v":"şeç'"},{"$f":"VLOOKUP(MOD(N,10^5)/1000,T,2)","v":"şeç'"}]
["yi",8,"yi","d21",{"$f":"IF(OR(F21=0,F21=\"\"),\"\",F21)","v":"şı"},{"$f":"IF(MOD(N,10^5)>=20000,VLOOKUP(MOD(N,10^4)/1000,T,2),\"\")","v":"şı"},null,null,"d15",null,"=IF(MOD(N,10^5)>=10^3,\"and \",\"\")"]
["bğu",9,"bğu","d22",{"$f":"IF(F22=0,\"\",F22)","v":"min"},{"$f":"IF(MOD(N,10^6)>=1000,K,\"\")","v":"min"}]
[null,10,"pş`ı","d23",{"$f":"IF(F23=\"zı\",\"\",IF(F23=0,\"\",F23))","v":"xı"},{"$f":"VLOOKUP(MOD(N,1000)/100,T,2)","v":"xı"}]
[null,11,"pş`ı zı","d24",{"$f":"IF(F24=0,\"\",F24)","v":"şe"},{"$f":"IF(MOD(N,1000)>=100,H,\"\")","v":"şe"}]
[null,12,"pş`ı t'`u","d25",{"$f":"IF(OR(N<21,N=30,N=40,N=50,N=60,N=70,N=80,N=90),F25,I28)","v":{"$error":"#NUM!"}},{"$f":"VLOOKUP(MOD(N,100),T,2)","v":{"$error":"#NUM!"}},null,null,"d21"]
[null,13,"pş`ı şı","d26",{"$f":"IF(OR(F26=0,F26=\"\"),\"\",F26)","v":{"$error":"#NUM!"}},{"$f":"IF(MOD(N,100)>20,VLOOKUP(MOD(N,10),T,2),\"\")","v":{"$error":"#NUM!"}}]
[null,14,"pş`ı pl'`ı"]
[null,15,"pş`ı tfı",null,null,null,null,null,{"$f":"IF(OR(F25=0,F25=\"\"),\"\",F25)","v":{"$error":"#NUM!"}}]
[null,16,"pş`ı xı"]
[null,17,"pş`ı blı"]
[null,18,"pş`ı yi",null,"şişe"]
[null,19,"pş`ı bğu",null,"pıl'`ışe"]
[null,20,"t'`oç'",null,"tfışe",{"$f":"IF(ROUND(MOD(MOD(N,10),1),2)>0.2,VLOOKUP(ROUND(MOD(MOD(N,10),0.1),2)*100,T,2),\"\")","v":{"$error":"#NUM!"}}]
[null,30,"şeç'",null,"xış",{"$f":"IF(MOD(MOD(N,10),1)>0,s,\"\")&IF(ROUND(MOD(MOD(N,10),1),2)>0.01,\"s\",\"\")","v":{"$error":"#NUM!"}}]
[null,40,{"$f":"IF(P2=40,\"pıl'`ç'\",\"pıl'`ıç'\")","v":"pıl'`ıç'"},null,"blışe",null,null,null,null,null,null,null,null,null,null,null,null,null,null,{"$f":"N","v":199273055133677}]
[null,50,{"$f":"IF(P2=50,\"tfıç'\",\"tfıç'\")","v":"tfıç'"},null,"yişe",null,null,null,null,null,null,null,null,null,null,null,null,null,null,{"$f":"MOD(N,10)","v":{"$error":"#NUM!"}}]
[null,60,{"$f":"IF(P2=60,\"xıç'\",\"xıç'\")","v":"xıç'"},null,"bğuşe"]
[null,70,{"$f":"IF(P2=70,\"blıç'\",\"blıç'\")","v":"blıç'"}]
[null,80,{"$f":"IF(P2=80,\"yiç'\",\"yiç'\")","v":"yiç'"},null,"şiş"]
[null,90,{"$f":"IF(P2=90,\"bğuç'\",\"bğuç'\")","v":"bğuç'"},null,"pıl'`ış"]
[null,null,null,null,"tfış"]
[null,"H","şe",null,"xış"]
[null,"K","min",null,"blış"]
[null,"M","melwan",null,"yiş"]
[null,"MIL","milyar",null,"bğuş"]

{"sheet":"l'ıte_3","index":9,"n_rows":45,"n_cols":18,"rows_kept":45,"cut":false,"hidden":true,"merged":[[1,1,1,4],[2,1,2,4]]}
[]
[null,{"$f":"PÇAĞE!B3","v":199273055133677}]
[null,{"$f":"IF(AND(N<200,N>100),D23&D24&C25&C26,C15&C11&C10&C13&C14&C21&C17&C16&C19&C20&C23&C22&C25&C26)","v":{"$error":"#NUM!"}}]
[]
[]
[]
[]
[]
[]
[0,null,{"$f":"IF(D10=0,\"\",D10&\"re \")","v":"bğuşre "},{"$f":"VLOOKUP(N/10^8,T,2)","v":"bğuş"}]
[1,"zı",{"$f":"IF(D11=0,\"\",D11)","v":"şi"},{"$f":"IF(N>=10^8,H,\"\")","v":"şi"}]
[2,"t'`u",null,{"$f":"IF(MOD(N,10^8)>=10^6,\"and \",\"\")","v":"and "}]
[3,"şı",{"$f":"IF(D13=0,\"\",D13&\"re \")","v":"tfışre "},{"$f":"VLOOKUP(MOD(N,10^8)/10^6,T,2)","v":"tfış"}]
[4,"pl'`ı",{"$f":"IF(OR(D14=0,D14=\"\"),\"\",D14&\"re \")","v":"tfıre "},{"$f":"IF(MOD(N,10^8)>=2*10^7,VLOOKUP(MOD(N,10^7)/10^6,T,2),\"\")","v":"tfı"},{"$f":"IF(D14=0,\"\",D14&\"re \")","v":"tfıre "}]
[5,"tfı",{"$f":"IF(D15=0,\"\",D15)","v":"melwan"},{"$f":"IF(N/10^6>=1,M,\"\")","v":"melwan"}]
[6,"xı",{"$f":"IF(D16=0,\"\",D16&\"re \")","v":"zıre "},{"$f":"VLOOKUP(MOD(N,10^6)/10^5,T,2)","v":"zı"}]
[7,"blı",{"$f":"IF(D17=0,\"\",D17)","v":"şi"},{"$f":"IF(MOD(N,10^6)>=10^5,H,\"\")","v":"şi"}]
[8,"yi",null,"=IF(MOD(N,10^5)>=10^3,\"and \",\"\")"]
[9,"bğu",{"$f":"IF(D19=0,\"\",D19&\"re \")","v":"şişre "},{"$f":"VLOOKUP(MOD(N,10^5)/1000,T,2)","v":"şiş"}]
[10,"pş`ı",{"$f":"IF(OR(D20=0,D20=\"\"),\"\",D20&\"re \")","v":"şıre "},{"$f":"IF(MOD(N,10^5)>=20000,VLOOKUP(MOD(N,10^4)/1000,T,2),\"\")","v":"şı"}]
[11,"pş`quz",{"$f":"IF(D21=0,\"\",D21)","v":"min"},{"$f":"IF(MOD(N,10^6)>=1000,K,\"\")","v":"min"}]
[12,"pş`qut'u",{"$f":"IF(OR(D22=0,D22=\"\",N=100),\"\",D22&\"re \")","v":"xıre "},{"$f":"VLOOKUP(MOD(N,1000)/100,T,2)","v":"xı"}]
[13,"pş`quş",{"$f":"IF(D23=0,\"\",D23)","v":"şi"},{"$f":"IF(MOD(N,1000)>=100,H,\"\")","v":"şi"}]
[14,"pş`qupl'`ı",null,{"$f":"IF(AND(MOD(N,100)>=1,N/100>=1),\"re \",\"\")","v":{"$error":"#NUM!"}}]
[15,"pş`qutfı",{"$f":"IF(OR(N<21,N=30,N=40,N=50,N=60,N=70,N=80,N=90),D25,G25)","v":{"$error":"#NUM!"}},{"$f":"VLOOKUP(MOD(N,100),T,2)","v":{"$error":"#NUM!"}},null,null,{"$f":"IF(OR(D25=0,D25=\"\"),\"\",D25&\"re \")","v":{"$error":"#NUM!"}}]
[16,"pş`quxı",{"$f":"IF(OR(D26=0,D26=\"\"),\"\",D26&\"re \")","v":{"$error":"#NUM!"}},{"$f":"IF(MOD(N,100)>20,VLOOKUP(MOD(N,10),T,2),\"\")","v":{"$error":"#NUM!"}}]
[17,"pş`qubl"]
[18,"pş`quyi",null,{"$f":"IF(AND(N>=1,MOD(MOD(N,10),1)>0),\"and \",\"\")","v":{"$error":"#NUM!"}}]
[19,"pş`qubğu"]
[20,"t'`oç'",null,{"$f":"IF(ROUND(MOD(MOD(N,10),1),2)>0.2,VLOOKUP(ROUND(MOD(MOD(N,10),0.1),2)*100,T,2),\"\")","v":{"$error":"#NUM!"}}]
[30,{"$f":"IF(N2=30,\"şişe\",\"şiş\")","v":"şiş"},"şişe",{"$f":"IF(MOD(MOD(N,10),1)>0,s,\"\")&IF(ROUND(MOD(MOD(N,10),1),2)>0.01,\"s\",\"\")","v":{"$error":"#NUM!"}}]
[40,{"$f":"IF(N2=40,\"pıl'`ışe\",\"pıl'`ış\")","v":"pıl'`ış"},"pıl'`ışe",null,null,null,null,null,null,null,null,null,null,null,null,null,null,{"$f":"N","v":199273055133677}]
[50,{"$f":"IF(N2=50,\"tfışe\",\"tfış\")","v":"tfış"},"tfışe",null,null,null,null,null,null,null,null,null,null,null,null,null,null,{"$f":"MOD(N,10)","v":{"$error":"#NUM!"}}]
[60,{"$f":"IF(N2=60,\"xişe\",\"xiş\")","v":"xiş"},"xışre"]
[70,{"$f":"IF(N2=70,\"blışe\",\"blış\")","v":"blış"},"blışe"]
[80,{"$f":"IF(N2=80,\"yişe\",\"yiş\")","v":"yiş"},"yişe"]
[90,{"$f":"IF(N2=90,\"bğuşe\",\"bğuş\")","v":"bğuş"},"bğuşe"]
[]
["H",{"$f":"IF(N>200,\"şi\",\"şe\")","v":"şi"},"şiş"]
["K","min","pıl'`ış"]
["M","melwan","tfış"]
[null,null,"xış"]
[null,null,"blış"]
[null,null,"yiş"]
[null,null,"bğuş"]

{"sheet":"AK","index":10,"n_rows":45,"n_cols":18,"rows_kept":45,"cut":false,"hidden":true,"merged":[[1,1,1,4],[2,1,2,4]]}
[]
[null,{"$f":"PÇAĞE!B3","v":199273055133677}]
[null,{"$f":"IF(AND(N<200,N>100),D23&D24&C25&C26,C15&C11&C10&C13&C14&C21&C17&C16&C19&C20&C23&C22&C25&C26)","v":{"$error":"#NUM!"}}]
[]
[]
[]
[]
[]
[]
[0,null,{"$f":"IF(D10=0,\"\",D10&\"рэ \")","v":"бгъущIрэ "},{"$f":"VLOOKUP(nn/10^8,tt,2)","v":"бгъущI"}]
[1,"зы",{"$f":"IF(D11=0,\"\",D11)","v":"щи"},{"$f":"IF(nn>=10^8,hh,\"\")","v":"щи"}]
[2,"тIу",null,{"$f":"IF(MOD(nn,10^8)>=10^6,\"and \",\"\")","v":"and "}]
[3,"щы",{"$f":"IF(D13=0,\"\",D13&\"рэ \")","v":"тфыщIрэ "},{"$f":"VLOOKUP(MOD(nn,10^8)/10^6,tt,2)","v":"тфыщI"}]
[4,"плIы",{"$f":"IF(OR(D14=0,D14=\"\"),\"\",D14&\"рэ \")","v":"тфырэ "},{"$f":"IF(MOD(nn,10^8)>=2*10^7,VLOOKUP(MOD(nn,10^7)/10^6,tt,2),\"\")","v":"тфы"},{"$f":"IF(D14=0,\"\",D14&\"рэ \")","v":"тфырэ "}]
[5,"тфы",{"$f":"IF(D15=0,\"\",D15)","v":"милуан"},{"$f":"IF(nn/10^6>=1,mm,\"\")","v":"милуан"}]
[6,"хы",{"$f":"IF(D16=0,\"\",D16&\"рэ \")","v":"зырэ "},{"$f":"VLOOKUP(MOD(nn,10^6)/10^5,tt,2)","v":"зы"}]
[7,"блы",{"$f":"IF(D17=0,\"\",D17)","v":"щи"},{"$f":"IF(MOD(nn,10^6)>=10^5,hh,\"\")","v":"щи"}]
[8,"и",null,"=IF(MOD(N,10^5)>=10^3,\"and \",\"\")"]
[9,"бгъуу",{"$f":"IF(D19=0,\"\",D19&\"рэ \")","v":"щэщIрэ "},{"$f":"VLOOKUP(MOD(nn,10^5)/1000,tt,2)","v":"щэщI"}]
[10,"пщIы",{"$f":"IF(OR(D20=0,D20=\"\"),\"\",D20&\"рэ \")","v":"щырэ "},{"$f":"IF(MOD(nn,10^5)>=20000,VLOOKUP(MOD(nn,10^4)/1000,tt,2),\"\")","v":"щы"}]
[11,"пщкIуз",{"$f":"IF(D21=0,\"\",D21)","v":"мин"},{"$f":"IF(MOD(nn,10^6)>=1000,kk,\"\")","v":"мин"}]
[12,"пщкIутI",{"$f":"IF(OR(D22=0,D22=\"\",nn=100),\"\",D22&\"рэ \")","v":"хырэ "},{"$f":"VLOOKUP(MOD(nn,1000)/100,tt,2)","v":"хы"}]
[13,"пщкIущ",{"$f":"IF(D23=0,\"\",D23)","v":"щи"},{"$f":"IF(MOD(nn,1000)>=100,hh,\"\")","v":"щи"}]
[14,"пщкIуплI",null,{"$f":"IF(AND(MOD(nn,100)>=1,nn/100>=1),\"рэ \",\"\")","v":{"$error":"#NUM!"}}]
[15,"пщкIутху",{"$f":"IF(OR(nn<21,nn=30,nn=40,nn=50,nn=60,nn=70,nn=80,nn=90),D25,G25)","v":{"$error":"#NUM!"}},{"$f":"VLOOKUP(MOD(nn,100),tt,2)","v":{"$error":"#NUM!"}},null,null,{"$f":"IF(OR(D25=0,D25=\"\"),\"\",D25&\"рэ \")","v":{"$error":"#NUM!"}}]
[16,"пщкIутфы",{"$f":"IF(OR(D26=0,D26=\"\"),\"\",D26&\"рэ \")","v":{"$error":"#NUM!"}},{"$f":"IF(MOD(nn,100)>20,VLOOKUP(MOD(nn,10),tt,2),\"\")","v":{"$error":"#NUM!"}}]
[17,"пщкIубл"]
[18,"пщкIуий",null,{"$f":"IF(AND(nn>=1,MOD(MOD(nn,10),1)>0),\"and \",\"\")","v":{"$error":"#NUM!"}}]
[19,"пщкIубгъу"]
[20,"тIощI",null,{"$f":"IF(ROUND(MOD(MOD(nn,10),1),2)>0.2,VLOOKUP(ROUND(MOD(MOD(nn,10),0.1),2)*100,tt,2),\"\")","v":{"$error":"#NUM!"}}]
[30,"щэщI","şişe",{"$f":"IF(MOD(MOD(nn,10),1)>0,ss,\"\")&IF(ROUND(MOD(MOD(nn,10),1),2)>0.01,\"s\",\"\")","v":{"$error":"#NUM!"}}]
[40,"плIыщI","pıl'`ışe",null,null,null,null,null,null,null,null,null,null,null,null,null,null,{"$f":"nn","v":199273055133677}]
[50,"тфыщI","tfışe",null,null,null,null,null,null,null,null,null,null,null,null,null,null,{"$f":"MOD(nn,10)","v":{"$error":"#NUM!"}}]
[60,"хыщI","xışрэ"]
[70,"блыщI","blışe"]
[80,"ищI","yişe"]
[90,"бгъущI","bğuşe"]
[]
["H",{"$f":"IF(N>200,\"щи\",\"щэ\")","v":"щи"},"şiş"]
["K","мин","pıl'`ış"]
["M","милуан","tfış"]
[null,null,"xış"]
[null,null,"blış"]
[null,null,"yiş"]
[null,null,"bğuş"]

{"sheet":"makro_ayarları","index":11,"n_rows":20,"n_cols":3,"rows_kept":20,"cut":false,"hidden":true,"merged":[[2,1,2,2],[3,1,3,2]]}
[]
[]
[null,"Excelde  makro ayarlarının yapılması "]
[null,"( Programının çalışabilmesi için gerekmektedir )"]
[]
[null,"OFİS 2007  Türkçe ise","OFİS 2007  İngilizce ise"]
[null,"Sol üst köşeseki Ofis arması tıklanır","Sol üst köşeseki Ofis arması tıklanır"]
[null,"Açılan menüden Excel seçenekleri tıklanır","Açılan menüden Excel options tıklanır"]
[null,"Güvenlik merkezi tıklanır","Trust center tıklanır"]
[null,"Güvenlik merkezi ayarları tıklanır","Trust center settings tıklanır"]
[null,"Makro ayarları tıklanır","Macros settings tıklanır"]
[null,"Makroları etkinleştir seçeneği işaretlenir","Enable Macros seçeneği işaretlenir"]
[]
[]
[null,"OFİS 2003  Türkçe ise","OFİS 2003  İngilizce ise"]
[null,"Araçlar menüsü tıklanır","Tools menüsü tıklanır"]
[null,"Makro tıklanır","Macros tıklanır"]
[null,"Güvenlik ayarları Orta seviye seçilir.","Macros security  Medium  seçilir."]
[null,"Ayarlar kaydedilir, excel  yeniden açılır. ","Ayarlar kaydedilir, excel  yeniden açılır. "]
[null,"Açılışta   Makrolar Etkinleştirilir ","Açılışta   Enable Macros etkinleştirilir "]